{"text_format":"1","workbook":"xlsx","n_sheets":3,"sheets":["Instructions","Input","Debt Liquidation Sched"],"not_rendered":{"charts":0,"images":0,"macros":1,"external_links":0,"defined_names":2,"comments":0,"pivot_tables":0},"unopened":[],"bounds":{"document_bytes":16777216,"sheet_cells":100000,"rows_first":2000,"rows_last":500,"rows_between":2000,"halvings":0,"cell_chars":16384,"cell_head_chars":4096},"cells_cut":0,"cells_raw":0,"read":"whole","date_system":"1900"}

{"sheet":"Instructions","index":0,"n_rows":7,"n_cols":4,"rows_kept":7,"cut":false,"hidden":false,"merged":[[13,1,14,7],[4,1,4,7],[5,1,5,7],[2,1,2,7],[3,1,3,7]]}
[null,"Instructions:"]
[]
[null,"1) On the \"Input\" tab (below), fill out the blue fields: the debt name, the balance, the interest rate and the minimum payment."]
[null,"2) Now click the \"Calculate\" button."]
[null,"3) At the bottom of the \"Input\" tab screen you'll see the \"Total Paid Each Month\" towards debt and \"Number of Months Until Paid\" it will take to be totally debt free--after paying both principal & interest."]
[null,"4) The \"Debt Liquidation Format\" tab will give you a more detailed breakdown of how each debt is addressed per month."]
[null,null,null,"**This worksheet uses the \"debt snowball\" approach"]

{"sheet":"Input","index":1,"n_rows":28,"n_cols":7,"rows_kept":28,"cut":false,"hidden":false,"merged":[]}
[]
[null,"Name"]
[null,"Date"]
[]
[]
[]
[]
[null,"Debt Name","Balance","Interest Rate","Minimum Payment","Time to pay off (months)","Interest Paid"]
[1,null,null,null,null,{"$f":"IFERROR(NPER(D9/12,-E9,C9,,0),\"\")","v":""},{"$f":"IF(B9=0,0,HLOOKUP(B9,'Debt Liquidation Sched'!$A$4:$BQ$372,369,FALSE))","v":0}]
[2,null,null,null,null,{"$f":"IFERROR(NPER(D10/12,-E10,C10,,0),\"\")","v":""},{"$f":"IF(B10=0,0,HLOOKUP(B10,'Debt Liquidation Sched'!$A$4:$BQ$372,369,FALSE))","v":0}]
[3,null,null,null,null,{"$f":"IFERROR(NPER(D11/12,-E11,C11,,0),\"\")","v":""},{"$f":"IF(B11=0,0,HLOOKUP(B11,'Debt Liquidation Sched'!$A$4:$BQ$372,369,FALSE))","v":0}]
[4,null,null,null,null,{"$f":"IFERROR(NPER(D12/12,-E12,C12,,0),\"\")","v":""},{"$f":"IF(B12=0,0,HLOOKUP(B12,'Debt Liquidation Sched'!$A$4:$BQ$372,369,FALSE))","v":0}]
[5,null,null,null,null,{"$f":"IFERROR(NPER(D13/12,-E13,C13,,0),\"\")","v":""},{"$f":"IF(B13=0,0,HLOOKUP(B13,'Debt Liquidation Sched'!$A$4:$BQ$372,369,FALSE))","v":0}]
[6,null,null,null,null,{"$f":"IFERROR(NPER(D14/12,-E14,C14,,0),\"\")","v":""},{"$f":"IF(B14=0,0,HLOOKUP(B14,'Debt Liquidation Sched'!$A$4:$BQ$372,369,FALSE))","v":0}]
[7,null,null,null,null,{"$f":"IFERROR(NPER(D15/12,-E15,C15,,0),\"\")","v":""},{"$f":"IF(B15=0,0,HLOOKUP(B15,'Debt Liquidation Sched'!$A$4:$BQ$372,369,FALSE))","v":0}]
[8,null,null,null,null,{"$f":"IFERROR(NPER(D16/12,-E16,C16,,0),\"\")","v":""},{"$f":"IF(B16=0,0,HLOOKUP(B16,'Debt Liquidation Sched'!$A$4:$BQ$372,369,FALSE))","v":0}]
[9,null,null,null,null,{"$f":"IFERROR(NPER(D17/12,-E17,C17,,0),\"\")","v":""},{"$f":"IF(B17=0,0,HLOOKUP(B17,'Debt Liquidation Sched'!$A$4:$BQ$372,369,FALSE))","v":0}]
[10,null,null,null,null,null,{"$f":"IF(B18=0,0,HLOOKUP(B18,'Debt Liquidation Sched'!$A$4:$BQ$372,369,FALSE))","v":0}]
[11,null,null,null,null,null,{"$f":"IF(B19=0,0,HLOOKUP(B19,'Debt Liquidation Sched'!$A$4:$BQ$372,369,FALSE))","v":0}]
[12,null,null,null,null,null,{"$f":"IF(B20=0,0,HLOOKUP(B20,'Debt Liquidation Sched'!$A$4:$BQ$372,369,FALSE))","v":0}]
[]
[null,"Total",{"$f":"SUM(C9:C20)","v":0},{"$f":"AVERAGE(D9:D20)","v":{"$error":"#DIV/0!"}},{"$f":"SUM(E9:E20)","v":0}]
[null,"Total Interest Paid",{"$f":"SUM(G9:G20)","v":0}]
[null,"Total Paid",{"$f":"SUM(C22:C23)","v":0}]
[]
[]
[null,"Total Paid Each Month",{"$f":"E22","v":0}]
[null,"Number of Months Until Paid",{"$f":"MAX(MATCH(0,'Debt Liquidation Sched'!E11:E370,0),MATCH(0,'Debt Liquidation Sched'!K11:K370,0),MATCH(0,'Debt Liquidation Sched'!Q11:Q370,0),MATCH(0,'Debt Liquidation Sched'!W11:W370,0),MATCH(0,'Debt Liquidation Sched'!AC11:AC370,0),MATCH(0,'Debt Liquidation Sched'!AI11:AI370,0),MATCH(0,'Debt Liquidation Sched'!AO11:AO370,0),MATCH(0,'Debt Liquidation Sched'!AU11:AU370,0),MATCH(0,'Debt Liquidation Sched'!BA11:BA370,0),MATCH(0,'Debt Liquidation Sched'!BG11:BG370,0),MATCH(0,'Debt Liquidation Sched'!BM11:BM370,0),MATCH(0,'Debt Liquidation Sched'!BS11:BS370,0))","v":1},{"$f":"CONCATENATE(TRUNC(C28/12), \" Years, \",ROUNDUP(C28-TRUNC(C28/12)*12,0),\" Months\")","v":"0 Years, 1 Months"}]

{"sheet":"Debt Liquidation Sched","index":2,"n_rows":372,"n_cols":75,"rows_kept":372,"cut":false,"hidden":false,"merged":[]}
["DEBT LIQUIDATION SCHEDULE"]
[null,null,null,null,null,null,null,null,null,null,null,null,null,null,null,null,null,null,null,null,null,null,null,null,null,null,null,null,null,null,null,null,null,null,null,null,null,null,null,null,null,null,null,null,null,null,null,null,null,null,null,null,null,null,null,null,null,null,null,null,null,null,null,null,null,null,null,null,null,null,null,null,"Key:"]
[1,null,null,null,null,null,2,null,null,null,null,null,3,null,null,null,null,null,4,null,null,null,null,null,5,null,null,null,null,null,6,null,null,null,null,null,7,null,null,null,null,null,8,null,null,null,null,null,9,null,null,null,null,null,10,null,null,null,null,null,11,null,null,null,null,null,12]
["ACCOUNT NAME:",null,{"$f":"IF(Input!B9=0,\"\",(Input!B9))","v":""},null,null,null,"ACCOUNT NAME:",null,{"$f":"IF(Input!B10=0,\"\",(Input!B10))","v":""},null,null,null,"ACCOUNT NAME:",null,{"$f":"IF(Input!B11=0,\"\",(Input!B11))","v":""},null,null,null,"ACCOUNT NAME:",null,{"$f":"IF(Input!B12=0,\"\",(Input!B12))","v":""},null,null,null,"ACCOUNT NAME:",null,{"$f":"IF(Input!B13=0,\"\",(Input!B13))","v":""},null,null,null,"ACCOUNT NAME:",null,{"$f":"IF(Input!B14=0,\"\",(Input!B14))","v":""},null,null,null,"ACCOUNT NAME:",null,{"$f":"IF(Input!B15=0,\"\",(Input!B15))","v":""},null,null,null,"ACCOUNT NAME:",null,{"$f":"IF(Input!B16=0,\"\",(Input!B16))","v":""},null,null,null,"ACCOUNT NAME:",null,{"$f":"IF(Input!B17=0,\"\",(Input!B17))","v":""},null,null,null,"ACCOUNT NAME:",null,{"$f":"IF(Input!B18=0,\"\",(Input!B18))","v":""},null,null,null,"ACCOUNT NAME:",null,{"$f":"IF(Input!B19=0,\"\",(Input!B19))","v":""},null,null,null,"ACCOUNT NAME:",null,{"$f":"IF(Input!B20=0,\"\",(Input!B20))","v":""},null,null,null,null,null,"Name & Date"]
["BALANCE:",null,null,{"$f":"Input!C9","v":0},null,null,"BALANCE:",null,null,{"$f":"Input!C10","v":0},null,null,"BALANCE:",null,null,{"$f":"Input!C11","v":0},null,null,"BALANCE:",null,null,{"$f":"Input!C12","v":0},null,null,"BALANCE:",null,null,{"$f":"Input!C13","v":0},null,null,"BALANCE:",null,null,{"$f":"Input!C14","v":0},null,null,"BALANCE:",null,null,{"$f":"Input!C15","v":0},null,null,"BALANCE:",null,null,{"$f":"Input!C16","v":0},null,null,"BALANCE:",null,null,{"$f":"Input!C17","v":0},null,null,"BALANCE:",null,null,{"$f":"Input!C18","v":0},null,null,"BALANCE:",null,null,{"$f":"Input!C19","v":0},null,null,"BALANCE:",null,null,{"$f":"Input!C20","v":0}]
["INTEREST:",null,null,{"$f":"E6/12","v":0},{"$f":"Input!D9","v":0},null,"INTEREST:",null,null,{"$f":"K6/12","v":0},{"$f":"Input!D10","v":0},null,"INTEREST:",null,null,{"$f":"Q6/12","v":0},{"$f":"Input!D11","v":0},null,"INTEREST:",null,null,{"$f":"W6/12","v":0},{"$f":"Input!D12","v":0},null,"INTEREST:",null,null,{"$f":"AC6/12","v":0},{"$f":"Input!D13","v":0},null,"INTEREST:",null,null,{"$f":"AI6/12","v":0},{"$f":"Input!D14","v":0},null,"INTEREST:",null,null,{"$f":"AO6/12","v":0},{"$f":"Input!D15","v":0},null,"INTEREST:",null,null,{"$f":"AU6/12","v":0},{"$f":"Input!D16","v":0},null,"INTEREST:",null,null,{"$f":"BA6/12","v":0},{"$f":"Input!D17","v":0},null,"INTEREST:",null,null,{"$f":"BG6/12","v":0},{"$f":"Input!D18","v":0},null,"INTEREST:",null,null,{"$f":"BM6/12","v":0},{"$f":"Input!D19","v":0},null,"INTEREST:",null,null,{"$f":"BS6/12","v":0},{"$f":"Input!D20","v":0},null,null,null,"Balance of credit card"]
["SCHEDULED PMT:",null,{"$f":"D7/D5","v":{"$error":"#DIV/0!"}},{"$f":"Input!E9","v":0},null,null,"SCHEDULED PMT:",null,{"$f":"J7/J5","v":{"$error":"#DIV/0!"}},{"$f":"Input!E10","v":0},null,null,"SCHEDULED PMT:",null,{"$f":"P7/P5","v":{"$error":"#DIV/0!"}},{"$f":"Input!E11","v":0},null,null,"SCHEDULED PMT:",null,{"$f":"V7/V5","v":{"$error":"#DIV/0!"}},{"$f":"Input!E12","v":0},null,null,"SCHEDULED PMT:",null,{"$f":"AB7/AB5","v":{"$error":"#DIV/0!"}},{"$f":"Input!E13","v":0},null,null,"SCHEDULED PMT:",null,{"$f":"AH7/AH5","v":{"$error":"#DIV/0!"}},{"$f":"Input!E14","v":0},null,null,"SCHEDULED PMT:",null,{"$f":"AN7/AN5","v":{"$error":"#DIV/0!"}},{"$f":"Input!E15","v":0},null,null,"SCHEDULED PMT:",null,{"$f":"AT7/AT5","v":{"$error":"#DIV/0!"}},{"$f":"Input!E16","v":0},null,null,"SCHEDULED PMT:",null,{"$f":"AZ7/AZ5","v":{"$error":"#DIV/0!"}},{"$f":"Input!E17","v":0},null,null,"SCHEDULED PMT:",null,{"$f":"BF7/BF5","v":{"$error":"#DIV/0!"}},{"$f":"Input!E18","v":0},null,null,"SCHEDULED PMT:",null,{"$f":"BL7/BL5","v":{"$error":"#DIV/0!"}},{"$f":"Input!E19","v":0},null,null,"SCHEDULED PMT:",null,{"$f":"BR7/BR5","v":{"$error":"#DIV/0!"}},{"$f":"Input!E20","v":0}]
[null,null,null,null,"END",null,null,null,null,null,"END",null,null,null,null,null,"END",null,null,null,null,null,"END",null,null,null,null,null,"END",null,null,null,null,null,"END",null,null,null,null,null,"END",null,null,null,null,null,"END",null,null,null,null,null,"END",null,null,null,null,null,"END",null,null,null,null,null,"END",null,null,null,null,null,"END",null,null,null,"Interest rate - APR%"]
["MO","BAL","INT","PMT","BAL",null,"MO","BAL","INT","PMT","BAL",null,"MO","BAL","INT","PMT","BAL",null,"MO","BAL","INT","PMT","BAL",null,"MO","BAL","INT","PMT","BAL",null,"MO","BAL","INT","PMT","BAL",null,"MO","BAL","INT","PMT","BAL",null,"MO","BAL","INT","PMT","BAL",null,"MO","BAL","INT","PMT","BAL",null,"MO","BAL","INT","PMT","BAL",null,"MO","BAL","INT","PMT","BAL",null,"MO","BAL","INT","PMT","BAL"]
[null,null,null,null,null,null,null,null,null,null,null,null,null,null,null,null,null,null,null,null,null,null,null,null,null,null,null,null,null,null,null,null,null,null,null,null,null,null,null,null,null,null,null,null,null,null,null,null,null,null,null,null,null,null,null,null,null,null,null,null,null,null,null,null,null,null,null,null,null,null,null,null,null,null,"Scheduled payment"]
[1,{"$f":"D5","v":0},{"$f":"B11*$D$6","v":0},{"$f":"$D$7","v":0},{"$f":"IF((B11+C11-D11)>0,B11+C11-D11,0)","v":0},null,1,{"$f":"J5","v":0},{"$f":"H11*$J$6","v":0},{"$f":"$J$7","v":0},{"$f":"IF((H11+I11-J11)>0,H11+I11-J11,0)","v":0},null,1,{"$f":"P5","v":0},{"$f":"N11*$P$6","v":0},{"$f":"$P$7","v":0},{"$f":"IF((N11+O11-P11)>0,N11+O11-P11,0)","v":0},null,1,{"$f":"V5","v":0},{"$f":"T11*$V$6","v":0},{"$f":"$V$7","v":0},{"$f":"IF((T11+U11-V11)>0,T11+U11-V11,0)","v":0},null,1,{"$f":"AB5","v":0},{"$f":"Z11*$AB$6","v":0},{"$f":"$AB$7","v":0},{"$f":"IF((Z11+AA11-AB11)>0,Z11+AA11-AB11,0)","v":0},null,1,{"$f":"AH5","v":0},{"$f":"AF11*$AH$6","v":0},{"$f":"$AH$7","v":0},{"$f":"IF((AF11+AG11-AH11)>0,AF11+AG11-AH11,0)","v":0},null,1,{"$f":"AN5","v":0},{"$f":"AL11*$AN$6","v":0},{"$f":"$AN$7","v":0},{"$f":"IF((AL11+AM11-AN11)>0,AL11+AM11-AN11,0)","v":0},null,1,{"$f":"AT5","v":0},{"$f":"AR11*$AT$6","v":0},{"$f":"$AT$7","v":0},{"$f":"IF((AR11+AS11-AT11)>0,AR11+AS11-AT11,0)","v":0},null,1,{"$f":"AZ5","v":0},{"$f":"AX11*$AZ$6","v":0},{"$f":"$AZ$7","v":0},{"$f":"IF((AX11+AY11-AZ11)>0,AX11+AY11-AZ11,0)","v":0},null,1,{"$f":"BF5","v":0},{"$f":"BD11*$BF$6","v":0},{"$f":"$BF$7","v":0},{"$f":"IF((BD11+BE11-BF11)>0,BD11+BE11-BF11,0)","v":0},null,1,{"$f":"BL5","v":0},{"$f":"BJ11*$BL$6","v":0},{"$f":"$BL$7","v":0},{"$f":"IF((BJ11+BK11-BL11)>0,BJ11+BK11-BL11,0)","v":0},null,1,{"$f":"BR5","v":0},{"$f":"BP11*$BR$6","v":0},{"$f":"$BR$7","v":0},{"$f":"IF((BP11+BQ11-BR11)>0,BP11+BQ11-BR11,0)","v":0}]
[2,{"$f":"E11","v":0},{"$f":"B12*$D$6","v":0},{"$f":"IF((E11)>0,$D$7,0)","v":0},{"$f":"IF((B12+C12-D12)>0,B12+C12-D12,0)","v":0},null,2,{"$f":"K11","v":0},{"$f":"H12*$J$6","v":0},{"$f":"IF((K11)>0,IF(E11=0,$J$7+$D$7,$J$7),0)","v":0},{"$f":"IF((H12+I12-J12)>0,H12+I12-J12,0)","v":0},null,2,{"$f":"Q11","v":0},{"$f":"N12*$P$6","v":0},{"$f":"IF((Q11)>0,IF(K11=0,$P$7+$J$7+$D$7,$P$7),0)","v":0},{"$f":"IF((N12+O12-P12)>0,N12+O12-P12,0)","v":0},null,2,{"$f":"W11","v":0},{"$f":"T12*$V$6","v":0},{"$f":"IF((W11)>0,IF(Q11=0,$P$7+$J$7+$D$7+$V$7,$V$7),0)","v":0},{"$f":"IF((T12+U12-V12)>0,T12+U12-V12,0)","v":0},null,2,{"$f":"AC11","v":0},{"$f":"Z12*$AB$6","v":0},{"$f":"IF((AC11)>0,IF(W11=0,$AB$7+$V$7+$P$7+$J$7+$D$7,$AB$7),0)","v":0},{"$f":"IF((Z12+AA12-AB12)>0,Z12+AA12-AB12,0)","v":0},null,2,{"$f":"AI11","v":0},{"$f":"AF12*$AH$6","v":0},{"$f":"IF((AI11)>0,IF(AC11=0,$AH$7+$AB$7+$V$7+$P$7+$J$7+$D$7,$AH$7),0)","v":0},{"$f":"IF((AF12+AG12-AH12)>0,AF12+AG12-AH12,0)","v":0},null,2,{"$f":"AO11","v":0},{"$f":"AL12*$AN$6","v":0},{"$f":"IF((AO11)>0,IF(AI11=0,$AN$7+$AH$7+$AB$7+$V$7+$P$7+$J$7+$D$7,$AN$7),0)","v":0},{"$f":"IF((AL12+AM12-AN12)>0,AL12+AM12-AN12,0)","v":0},null,2,{"$f":"AU11","v":0},{"$f":"AR12*$AT$6","v":0},{"$f":"IF((AU11)>0,IF(AO11=0,$AT$7+$AN$7+$AH$7+$AB$7+$V$7+$P$7+$J$7+$D$7,$AT$7),0)","v":0},{"$f":"IF((AR12+AS12-AT12)>0,AR12+AS12-AT12,0)","v":0},null,2,{"$f":"BA11","v":0},{"$f":"AX12*$AZ$6","v":0},{"$f":"IF((BA11)>0,IF(AU11=0,$AZ$7+$AT$7+$AN$7+$AH$7+$AB$7+$V$7+$P$7+$J$7+$D$7,$AZ$7),0)","v":0},{"$f":"IF((AX12+AY12-AZ12)>0,AX12+AY12-AZ12,0)","v":0},null,2,{"$f":"BG11","v":0},{"$f":"BD12*$BF$6","v":0},{"$f":"IF((BG11)>0,IF(BA11=0,$BF$7+$AZ$7+$AT$7+$AN$7+$AH$7+$AB$7+$V$7+$P$7+$J$7+$D$7,$BF$7),0)","v":0},{"$f":"IF((BD12+BE12-BF12)>0,BD12+BE12-BF12,0)","v":0},null,2,{"$f":"BM11","v":0},{"$f":"BJ12*$BL$6","v":0},{"$f":"IF((BM11)>0,IF(BG11=0,$BL$7+$BF$7+$AZ$7+$AT$7+$AN$7+$AH$7+$AB$7+$V$7+$P$7+$J$7+$D$7,$BL$7),0)","v":0},{"$f":"IF((BJ12+BK12-BL12)>0,BJ12+BK12-BL12,0)","v":0},null,2,{"$f":"BS11","v":0},{"$f":"BP12*$BR$6","v":0},{"$f":"IF((BS11)>0,IF(BM11=0,$BR$7+$BL$7+$BF$7+$AZ$7+$AT$7+$AN$7+$AH$7+$AB$7+$V$7+$P$7+$J$7+$D$7,$BR$7),0)","v":0},{"$f":"IF((BP12+BQ12-BR12)>0,BP12+BQ12-BR12,0)","v":0}]
[3,{"$f":"E12","v":0},{"$f":"B13*$D$6","v":0},{"$f":"IF((E12)>0,$D$7,0)","v":0},{"$f":"IF((B13+C13-D13)>0,B13+C13-D13,0)","v":0},null,3,{"$f":"K12","v":0},{"$f":"H13*$J$6","v":0},{"$f":"IF((K12)>0,IF(E12=0,$J$7+$D$7,$J$7),0)","v":0},0,null,3,{"$f":"Q12","v":0},{"$f":"N13*$P$6","v":0},{"$f":"IF((Q12)>0,IF(K12=0,$P$7+$J$7+$D$7,$P$7),0)","v":0},0,null,3,{"$f":"W12","v":0},0,{"$f":"IF((W12)>0,IF(Q12=0,$P$7+$J$7+$D$7+$V$7,$V$7),0)","v":0},0,null,3,{"$f":"AC12","v":0},0,{"$f":"IF((AC12)>0,IF(W12=0,$AB$7+$V$7+$P$7+$J$7+$D$7,$AB$7),0)","v":0},0,null,3,{"$f":"AI12","v":0},0,{"$f":"IF((AI12)>0,IF(AC12=0,$AH$7+$AB$7+$V$7+$P$7+$J$7+$D$7,$AH$7),0)","v":0},0,null,3,{"$f":"AO12","v":0},0,{"$f":"IF((AO12)>0,IF(AI12=0,$AN$7+$AH$7+$AB$7+$V$7+$P$7+$J$7+$D$7,$AN$7),0)","v":0},{"$f":"IF((AL13+AM13-AN13)>0,AL13+AM13-AN13,0)","v":0},null,3,{"$f":"AU12","v":0},0,{"$f":"IF((AU12)>0,IF(AO12=0,$AT$7+$AN$7+$AH$7+$AB$7+$V$7+$P$7+$J$7+$D$7,$AT$7),0)","v":0},0,null,3,{"$f":"BA12","v":0},0,{"$f":"IF((BA12)>0,IF(AU12=0,$AZ$7+$AT$7+$AN$7+$AH$7+$AB$7+$V$7+$P$7+$J$7+$D$7,$AZ$7),0)","v":0},0,null,3,{"$f":"BG12","v":0},0,{"$f":"IF((BG12)>0,IF(BA12=0,$BF$7+$AZ$7+$AT$7+$AN$7+$AH$7+$AB$7+$V$7+$P$7+$J$7+$D$7,$BF$7),0)","v":0},0,null,3,{"$f":"BM12","v":0},0,{"$f":"IF((BM12)>0,IF(BG12=0,$BL$7+$BF$7+$AZ$7+$AT$7+$AN$7+$AH$7+$AB$7+$V$7+$P$7+$J$7+$D$7,$BL$7),0)","v":0},0,null,3,{"$f":"BS12","v":0},0,{"$f":"IF((BS12)>0,IF(BM12=0,$BR$7+$BL$7+$BF$7+$AZ$7+$AT$7+$AN$7+$AH$7+$AB$7+$V$7+$P$7+$J$7+$D$7,$BR$7),0)","v":0},0]
[4,0,0,0,0,null,4,0,0,0,0,null,4,0,0,0,0,null,4,0,0,0,0,null,4,0,0,0,0,null,4,0,0,0,0,null,4,0,0,0,0,null,4,0,0,0,0,null,4,0,0,0,0,null,4,0,0,0,0,null,4,0,0,0,0,null,4,0,0,0,0]
[5,0,0,0,0,null,5,0,0,0,0,null,5,0,0,0,0,null,5,0,0,0,0,null,5,0,0,0,0,null,5,0,0,0,0,null,5,0,0,0,0,null,5,0,0,0,0,null,5,0,0,0,0,null,5,0,0,0,0,null,5,0,0,0,0,null,5,0,0,0,0]
[6,0,0,0,0,null,6,0,0,0,0,null,6,0,0,0,0,null,6,0,0,0,0,null,6,0,0,0,0,null,6,0,0,0,0,null,6,0,0,0,0,null,6,0,0,0,0,null,6,0,0,0,0,null,6,0,0,{"$f":"IF((BG15)>0,IF(BA15=0,$BF$7+$AZ$7+$AT$7+$AN$7+$AH$7+$AB$7+$V$7+$P$7+$J$7+$D$7,$BF$7),0)","v":0},0,null,6,0,0,0,0,null,6,0,0,0,0]
[7,0,0,0,0,null,7,0,0,0,0,null,7,0,0,0,0,null,7,0,0,0,0,null,7,0,0,0,0,null,7,0,0,0,0,null,7,0,0,0,0,null,7,0,0,0,0,null,7,0,0,0,0,null,7,0,0,0,0,null,7,0,0,0,0,null,7,0,0,0,0]
[8,{"$f":"E17","v":0},{"$f":"B18*$D$6","v":0},0,0,null,8,0,0,0,0,null,8,0,0,0,0,null,8,0,0,0,0,null,8,0,0,0,0,null,8,0,0,0,0,null,8,0,0,0,0,null,8,0,0,0,0,null,8,0,0,0,0,null,8,0,0,0,0,null,8,0,0,0,0,null,8,0,0,0,0]
[9,0,0,0,0,null,9,0,0,0,0,null,9,0,0,0,0,null,9,0,0,0,0,null,9,0,0,0,0,null,9,0,0,0,0,null,9,0,0,0,0,null,9,0,0,0,0,null,9,0,0,0,0,null,9,0,0,0,0,null,9,0,0,0,0,null,9,0,0,0,0]
[10,0,0,0,0,null,10,0,0,0,0,null,10,0,0,0,0,null,10,0,0,0,0,null,10,0,0,0,0,null,10,0,0,0,0,null,10,0,0,0,0,null,10,0,0,0,0,null,10,0,0,0,0,null,10,0,0,0,0,null,10,0,0,0,0,null,10,0,0,0,0]
[11,0,0,0,0,null,11,0,0,0,0,null,11,0,0,0,0,null,11,0,0,0,0,null,11,0,0,0,0,null,11,0,0,0,0,null,11,0,0,0,0,null,11,0,0,0,0,null,11,0,0,0,0,null,11,0,0,0,0,null,11,0,0,{"$f":"IF((BM20)>0,IF(BG20=0,$BL$7+$BF$7+$AZ$7+$AT$7+$AN$7+$AH$7+$AB$7+$V$7+$P$7+$J$7+$D$7,$BL$7),0)","v":0},0,null,11,0,0,0,0]
[12,0,0,0,0,null,12,0,0,0,0,null,12,0,0,0,0,null,12,0,0,0,0,null,12,0,0,0,0,null,12,0,0,0,0,null,12,0,0,0,0,null,12,0,0,0,0,null,12,0,0,0,0,null,12,0,0,0,0,null,12,0,0,0,0,null,12,0,0,0,0]
[13,0,0,0,0,null,13,0,0,0,0,null,13,0,0,0,0,null,13,0,0,0,0,null,13,0,0,0,0,null,13,0,0,0,0,null,13,0,0,0,0,null,13,0,0,0,0,null,13,0,0,0,0,null,13,0,0,0,0,null,13,0,0,0,0,null,13,0,0,0,0]
[14,0,0,0,0,null,14,0,0,0,0,null,14,0,0,0,0,null,14,0,0,0,0,null,14,0,0,0,0,null,14,0,0,0,0,null,14,0,0,0,0,null,14,0,0,0,0,null,14,0,0,0,0,null,14,0,0,0,0,null,14,0,0,0,0,null,14,0,0,0,0]
[15,0,0,0,0,null,15,0,0,0,0,null,15,0,0,0,0,null,15,0,0,0,0,null,15,0,0,0,0,null,15,0,0,0,0,null,15,0,0,0,{"$f":"IF((AL25+AM25-AN25)>0,AL25+AM25-AN25,0)","v":0},null,15,0,0,0,0,null,15,0,0,0,0,null,15,0,0,0,0,null,15,0,0,0,0,null,15,0,0,0,0]
[16,0,0,0,0,null,16,0,0,0,0,null,16,0,0,0,0,null,16,0,0,0,0,null,16,0,0,0,0,null,16,0,0,0,0,null,16,0,0,0,0,null,16,0,0,0,0,null,16,0,0,0,0,null,16,0,0,0,0,null,16,0,0,0,0,null,16,0,0,0,0]
[17,0,0,0,0,null,17,0,0,0,0,null,17,0,0,0,0,null,17,0,0,0,0,null,17,0,0,0,0,null,17,0,0,0,0,null,17,0,0,0,0,null,17,0,0,0,0,null,17,0,0,0,0,null,17,0,0,0,0,null,17,0,0,0,0,null,17,0,0,0,0]
[18,0,0,0,0,null,18,0,0,0,0,null,18,0,0,0,0,null,18,0,0,0,0,null,18,0,0,0,0,null,18,0,0,0,0,null,18,0,0,0,0,null,18,0,0,0,0,null,18,0,0,0,0,null,18,0,0,0,0,null,18,0,0,0,0,null,18,0,0,0,0]
[19,0,0,0,0,null,19,0,0,0,0,null,19,0,0,0,0,null,19,0,0,0,{"$f":"IF((T29+U29-V29)>0,T29+U29-V29,0)","v":0},null,19,0,0,0,0,null,19,0,0,0,0,null,19,0,0,0,0,null,19,0,0,0,0,null,19,0,0,{"$f":"IF((BA28)>0,IF(AU28=0,$AZ$7+$AT$7+$AN$7+$AH$7+$AB$7+$V$7+$P$7+$J$7+$D$7,$AZ$7),0)","v":0},0,null,19,0,0,0,0,null,19,0,0,0,0,null,19,0,0,0,0]
[20,0,0,0,0,null,20,0,0,0,0,null,20,0,0,0,0,null,20,0,0,0,0,null,20,0,0,0,0,null,20,0,0,0,0,null,20,0,0,0,0,null,20,0,0,0,0,null,20,0,0,0,0,null,20,0,0,0,0,null,20,0,0,0,0,null,20,0,0,0,0]
[21,0,0,0,0,null,21,0,0,0,0,null,21,0,0,0,0,null,21,0,0,0,0,null,21,0,0,0,0,null,21,0,0,0,0,null,21,0,0,0,0,null,21,0,0,0,0,null,21,0,0,0,0,null,21,0,0,0,0,null,21,0,0,0,0,null,21,0,0,0,0]
[22,0,0,0,0,null,22,0,0,0,0,null,22,0,0,0,0,null,22,0,0,0,0,null,22,0,0,0,0,null,22,0,0,0,0,null,22,0,0,0,0,null,22,0,0,0,0,null,22,0,0,0,0,null,22,0,0,0,0,null,22,0,0,0,0,null,22,0,0,0,0]
[23,0,0,0,0,null,23,0,0,0,0,null,23,0,0,0,0,null,23,0,0,0,0,null,23,0,0,0,0,null,23,0,0,0,0,null,23,0,0,0,0,null,23,0,0,0,0,null,23,0,0,0,0,null,23,0,0,0,0,null,23,0,0,0,0,null,23,0,0,0,0]
[24,0,0,0,0,null,24,0,0,0,0,null,24,0,0,0,0,null,24,0,0,0,0,null,24,0,0,0,0,null,24,0,0,0,0,null,24,0,0,0,0,null,24,0,0,0,0,null,24,0,0,0,0,null,24,0,0,0,0,null,24,0,0,0,0,null,24,0,0,0,0]
[25,0,0,0,0,null,25,0,0,0,0,null,25,0,0,0,0,null,25,0,0,0,0,null,25,0,0,0,0,null,25,0,0,0,0,null,25,0,0,0,0,null,25,0,0,0,0,null,25,0,0,0,0,null,25,0,0,0,0,null,25,0,0,0,0,null,25,0,0,0,0]
[26,0,0,0,0,null,26,0,0,0,0,null,26,0,0,0,0,null,26,0,0,0,0,null,26,0,0,0,0,null,26,0,0,0,0,null,26,0,0,0,0,null,26,0,0,0,0,null,26,0,0,0,0,null,26,0,0,0,0,null,26,0,0,0,0,null,26,0,0,0,0]
[27,0,0,0,0,null,27,0,0,0,0,null,27,0,0,0,0,null,27,0,0,0,0,null,27,0,0,0,0,null,27,0,0,0,0,null,27,0,0,0,0,null,27,0,0,0,0,null,27,0,0,0,0,null,27,0,0,0,0,null,27,0,0,0,0,null,27,0,0,0,0]
[28,0,0,0,0,null,28,0,0,0,0,null,28,0,0,0,0,null,28,0,0,0,0,null,28,0,0,0,0,null,28,0,0,0,0,null,28,0,0,0,0,null,28,0,0,0,0,null,28,0,0,0,0,null,28,0,0,0,0,null,28,0,0,0,0,null,28,0,0,0,0]
[29,0,0,0,0,null,29,0,0,0,{"$f":"IF((H39+I39-J39)>0,H39+I39-J39,0)","v":0},null,29,0,0,0,0,null,29,0,0,0,0,null,29,0,0,0,0,null,29,0,0,0,0,null,29,0,0,0,0,null,29,0,0,0,0,null,29,0,0,0,0,null,29,0,0,0,0,null,29,0,0,0,0,null,29,0,0,0,0]
[30,0,0,{"$f":"IF((E39)>0,$D$7,0)","v":0},0,null,30,0,0,0,0,null,30,0,0,0,0,null,30,0,0,0,0,null,30,0,0,0,0,null,30,0,0,0,0,null,30,0,0,0,0,null,30,0,0,0,0,null,30,0,0,0,0,null,30,0,0,0,0,null,30,0,0,0,0,null,30,0,0,0,0]
[31,0,0,0,0,null,31,0,0,0,0,null,31,0,0,0,0,null,31,0,0,0,0,null,31,0,0,0,0,null,31,0,0,0,0,null,31,0,0,0,0,null,31,0,0,0,0,null,31,0,0,0,0,null,31,0,0,0,0,null,31,0,0,0,0,null,31,0,0,0,0]
[32,0,0,0,0,null,32,0,0,0,0,null,32,0,0,0,0,null,32,0,0,0,0,null,32,0,0,0,0,null,32,0,0,0,0,null,32,0,0,0,0,null,32,0,0,0,0,null,32,0,0,0,0,null,32,0,0,0,0,null,32,0,0,0,0,null,32,0,0,0,0]
[33,0,0,0,0,null,33,0,0,0,0,null,33,0,0,0,0,null,33,0,0,0,0,null,33,0,0,0,0,null,33,0,0,0,0,null,33,0,0,0,0,null,33,0,0,0,0,null,33,0,0,0,0,null,33,0,0,0,0,null,33,0,0,0,0,null,33,0,0,0,0]
[34,0,0,0,0,null,34,0,0,0,0,null,34,0,0,0,0,null,34,0,0,0,0,null,34,0,0,0,0,null,34,0,0,0,0,null,34,0,0,0,0,null,34,0,0,0,0,null,34,0,0,0,0,null,34,0,0,0,0,null,34,0,0,0,0,null,34,0,0,0,0]
[35,0,0,0,0,null,35,0,0,0,0,null,35,0,0,0,0,null,35,0,0,0,0,null,35,0,0,0,0,null,35,0,0,0,0,null,35,0,0,0,0,null,35,0,0,0,0,null,35,0,0,0,0,null,35,0,0,0,0,null,35,0,0,0,0,null,35,0,0,0,0]
[36,0,0,0,0,null,36,0,0,0,0,null,36,0,0,0,0,null,36,0,0,0,0,null,36,0,0,0,0,null,36,0,0,0,0,null,36,0,0,0,0,null,36,0,0,0,0,null,36,0,0,0,0,null,36,0,0,0,0,null,36,0,0,0,0,null,36,0,0,0,0]
[37,0,0,0,0,null,37,0,0,0,0,null,37,0,0,0,0,null,37,0,0,0,0,null,37,0,0,0,0,null,37,0,0,0,0,null,37,0,0,0,0,null,37,0,0,0,0,null,37,0,0,0,0,null,37,0,0,0,0,null,37,0,0,0,0,null,37,0,0,0,0]
[38,0,0,0,0,null,38,0,0,0,0,null,38,0,0,0,0,null,38,0,0,0,0,null,38,0,0,0,0,null,38,0,0,0,0,null,38,0,0,0,0,null,38,0,0,0,0,null,38,0,0,0,0,null,38,0,0,0,0,null,38,0,0,0,0,null,38,0,0,0,0]
[39,0,0,0,0,null,39,0,0,0,0,null,39,0,0,0,0,null,39,0,0,0,0,null,39,0,0,0,0,null,39,0,0,0,0,null,39,0,0,0,0,null,39,0,0,0,0,null,39,0,0,0,0,null,39,0,0,0,0,null,39,0,0,0,0,null,39,0,0,0,0]
[40,0,0,0,0,null,40,0,0,0,0,null,40,0,0,0,0,null,40,0,0,0,0,null,40,0,0,0,0,null,40,0,0,0,0,null,40,0,0,0,0,null,40,0,0,0,0,null,40,0,0,0,0,null,40,0,0,0,0,null,40,0,0,0,0,null,40,0,0,0,0]
[41,0,0,0,0,null,41,0,0,0,0,null,41,0,0,0,0,null,41,0,0,0,0,null,41,0,0,0,0,null,41,0,0,0,0,null,41,0,0,0,0,null,41,0,0,0,0,null,41,0,0,0,0,null,41,0,0,0,0,null,41,0,0,0,0,null,41,0,0,0,0]
[42,0,0,0,0,null,42,0,0,0,0,null,42,0,0,0,0,null,42,0,0,0,0,null,42,0,0,0,0,null,42,0,0,0,0,null,42,0,0,0,0,null,42,0,0,0,0,null,42,0,0,0,0,null,42,0,0,0,0,null,42,0,0,0,0,null,42,0,0,0,0]
[43,0,0,0,0,null,43,0,0,0,0,null,43,0,0,0,0,null,43,0,0,0,0,null,43,0,0,0,0,null,43,0,0,0,0,null,43,0,0,0,0,null,43,0,0,0,0,null,43,0,0,0,0,null,43,0,0,0,0,null,43,0,0,0,0,null,43,0,0,{"$f":"IF((BS52)>0,IF(BM52=0,$BR$7+$BL$7+$BF$7+$AZ$7+$AT$7+$AN$7+$AH$7+$AB$7+$V$7+$P$7+$J$7+$D$7,$BR$7),0)","v":0},0]
[44,0,0,0,0,null,44,0,0,0,0,null,44,0,0,0,0,null,44,0,0,0,0,null,44,0,0,0,0,null,44,0,0,0,0,null,44,0,0,0,0,null,44,0,0,0,0,null,44,0,0,0,0,null,44,0,0,0,0,null,44,0,0,0,0,null,44,0,0,0,0]
[45,0,0,0,0,null,45,0,0,0,0,null,45,0,0,0,0,null,45,0,0,0,0,null,45,0,0,0,0,null,45,0,0,0,0,null,45,0,0,0,0,null,45,0,0,0,0,null,45,0,0,0,0,null,45,0,0,0,0,null,45,0,0,0,0,null,45,0,0,0,0]
[46,0,0,0,0,null,46,0,0,0,0,null,46,0,0,0,0,null,46,0,0,0,0,null,46,0,0,0,0,null,46,0,0,0,0,null,46,0,0,0,0,null,46,0,0,0,0,null,46,0,0,0,0,null,46,0,0,0,0,null,46,0,0,0,0,null,46,0,0,0,0]
[47,0,0,0,0,null,47,0,0,0,0,null,47,0,0,0,0,null,47,0,0,0,0,null,47,0,0,0,0,null,47,0,0,0,0,null,47,0,0,0,0,null,47,0,0,0,0,null,47,0,0,0,0,null,47,0,0,0,0,null,47,0,0,0,0,null,47,0,0,0,0]
[48,0,0,0,0,null,48,0,0,0,0,null,48,0,0,0,0,null,48,0,0,0,0,null,48,0,0,0,0,null,48,0,0,0,0,null,48,0,0,0,0,null,48,0,0,0,0,null,48,0,0,0,0,null,48,0,0,0,0,null,48,0,0,0,0,null,48,0,0,0,0]
[49,0,0,0,0,null,49,0,0,0,0,null,49,0,0,0,0,null,49,0,0,0,0,null,49,0,0,0,0,null,49,0,0,0,0,null,49,0,0,0,0,null,49,0,0,0,0,null,49,0,0,0,0,null,49,0,0,0,0,null,49,0,0,0,0,null,49,0,0,0,0]
[50,0,0,0,0,null,50,0,0,0,0,null,50,0,0,0,0,null,50,0,0,0,0,null,50,0,0,0,0,null,50,0,0,0,0,null,50,0,0,0,0,null,50,0,0,0,0,null,50,0,0,0,0,null,50,0,0,0,0,null,50,0,0,0,0,null,50,0,0,0,0]
{"$rows_left_out":312}