{"text_format":"1","workbook":"xlsx","n_sheets":36,"sheets":["Intro","Personal Info","Income Entry 1","Income Entry 2","Income Entry 3","Income Entry 4","Income Note","Income Summary","Expense Entry 1","Expense Entry 2","Expense Entry 3","Expense Entry 4","Expense Note","Expense Summary","Truths","Giving","Saving","Debt","Goals Summary","Spending Analysis Note","Current Spending Analysis","Lifestyle & Budgeting","Person 1 Budget","Person 2 Budget","New Agreed Budget","Balancing Note","Recording Note","Retirement Calculations","Debt Liquidation Sched","Debt Page","Drop Downs","Retirement Scenario","Macros","Savings Guide","Spending Guides","Intake Page"],"not_rendered":{"charts":0,"images":0,"macros":1,"external_links":0,"defined_names":18,"comments":2,"pivot_tables":0},"unopened":[],"bounds":{"document_bytes":16777216,"sheet_cells":100000,"rows_first":2000,"rows_last":500,"rows_between":2000,"halvings":0,"cell_chars":16384,"cell_head_chars":4096},"cells_cut":0,"cells_raw":0,"read":"whole","date_system":"1900"}

{"sheet":"Intro","index":0,"n_rows":21,"n_cols":2,"rows_kept":21,"cut":false,"hidden":false,"merged":[[0,1,0,7],[8,1,13,7],[20,1,24,7],[3,1,6,7],[15,1,18,7]]}
[null,"The Personal Finance Workbook"]
[]
[null,"Introduction"]
[null,"As each one has received a special gift, employ it in serving one another, as good stewards of the manifold grace of God.\n-1 Peter 4:10\n"]
[]
[]
[]
[]
[null,"The Bible is clear that everything we have is on loan from God, including the money that we earn or are given.  Our stewardship is to use that money to reflect what a loving God He is, yet many times we become overly anxious, obsessed with, or wildly irresponsible with those resources.  Thankfully, God hasn’t left us to figure it out on our own.  He is actively helping us recognize that His Son’s sacrifice for us can transform even our deepest habits and our most damaging mindsets.\n\n\n"]
[]
[]
[]
[]
[]
[]
[null,"This workbook is designed to help you learn what the Bible says about your money as you analyze your current spending, set goals, and create a new budget.  As we go along, be sure to keep seeking what God says and be close to Him in prayer about what He wants you to do with the money He's given you."]
[]
[]
[]
[]
[null,"To help you summarize your current financial situation, you’ll want to have a current paycheck and 3-6 months’ worth of bank statements to work from.  It will also be helpful to have statements from any loans (credit cards, student loans, auto payments, etc.) that you may have.  Don't be afraid to put down the REAL numbers and not just what you want others to see.  "]

{"sheet":"Personal Info","index":1,"n_rows":11,"n_cols":7,"rows_kept":11,"cut":false,"hidden":false,"merged":[[0,0,0,16383],[2,0,3,6],[4,1,5,5]]}
["Personal Information"]
[]
["The first step is to enter your personal information so that the numbers in this workbook will be tailored to your situation."]
[]
[null,"**Note: Throughout this workbook you can fill out any areas in     If something doesn't apply, you can just leave it blank.",null,null,null,null,"Blue"]
[]
[]
[null,null,"Your Name:"]
[null,null,"Spouse's Name:"]
[null,null,"Marital Status:"]
[null,null,"How many kids do you have?"]

{"sheet":"Income Entry 1","index":2,"n_rows":38,"n_cols":6,"rows_kept":38,"cut":false,"hidden":false,"merged":[[22,1,23,6],[2,0,3,6],[4,1,4,4],[0,0,0,6]]}
["s Income"]
[]
["Now you're going to enter information straight from your paycheck to see roughly how much you make per year.  Make sure that the paycheck you use is a pretty typical paycheck."]
[]
[null,"**Note: Throughout this workbook you can fill out any areas in ",null,null,null,"Blue"]
[]
[]
["1. How often are you paid per year?"]
[]
["2. Enter the total amount you make per paycheck, a.k.a. the \"Gross Amount\""]
[]
[null,null,"# of Pay Periods","Pay Frequency"]
[null,null,52,"Weekly"]
[null,null,26,"Every other week"]
[null,null,24,"Twice per Month"]
[null,null,12,"Monthly"]
[null,null,4,"Quarterly"]
[null,null,2,"Semi-Annually"]
[null,null,1,"Annually (or W-2)"]
[]
[]
["3. Enter the amounts of what is taken out of your paycheck: aka., your withholding and deductions."]
[null,"**Note: If it's hard to tell what is what on your paycheck, or if you don't have all of these items, feel free to use the \"Other\" boxes or leave some blank."]
[]
[]
[null,null,null,null,"Social Security/PERS"]
[null,null,null,null,"Medicare"]
[null,null,null,null,"Federal Income Taxes"]
[null,null,null,null,"State Income Taxes"]
[null,null,null,null,"City / Local Taxes"]
[null,null,null,null,"Dues"]
[null,null,null,null,"401(k)/403(b)"]
[null,null,null,null,"Pre-Tax SAVINGS"]
[null,null,null,null,"Health Insurance/HSA/FSA"]
[null,null,null,null,"Other"]
[null,null,null,null,"Other"]
[null,null,null,null,"Other"]
[null,null,null,null,"Other"]

{"sheet":"Income Entry 2","index":3,"n_rows":38,"n_cols":5,"rows_kept":38,"cut":false,"hidden":false,"merged":[[0,0,0,6],[22,1,23,6],[2,0,4,6],[5,1,5,16383]]}
["Other Income"]
[]
["Do you have a second source of income for your household?  Either a second job or another person working?  Even if the second income is sporadic or only once per year, you'll need to get at least a baseline for another income source. Enter that information below."]
[]
[]
[null,"**Note:  If you get bonuses, rental income, or have other sources of income, you can enter those on the next screen."]
[]
["1. How often are you paid per year?"]
[]
["2. Enter the total amount you make per paycheck, a.k.a. the \"Gross Amount\""]
[]
[null,null,"# of Pay Periods","Pay Frequency"]
[null,null,52,"Weekly"]
[null,null,26,"Every other week"]
[null,null,24,"Twice per Month"]
[null,null,12,"Monthly"]
[null,null,4,"Quarterly"]
[null,null,2,"Semi-Annually"]
[null,null,1,"Annually (or W-2)"]
[]
[]
["3. Enter the amounts of what is taken out of your paycheck: aka., your withholding and deductions."]
[null,"**Note: If it's hard to tell what is what on your paycheck, or if you don't have all of these items, feel free to use the \"Other\" boxes or leave some blank."]
[]
[]
[null,null,null,null,"Social Security/PERS"]
[null,null,null,null,"Medicare"]
[null,null,null,null,"Federal Income Taxes"]
[null,null,null,null,"State Income Taxes"]
[null,null,null,null,"City / Local Taxes"]
[null,null,null,null,"Dues"]
[null,null,null,null,"401(k)/403(b)"]
[null,null,null,null,"Pre-Tax SAVINGS"]
[null,null,null,null,"Health Insurance/HSA/FSA"]
[null,null,null,null,"Other"]
[null,null,null,null,"Other"]
[null,null,null,null,"Other"]
[null,null,null,null,"Other"]

{"sheet":"Income Entry 3","index":4,"n_rows":13,"n_cols":5,"rows_kept":13,"cut":false,"hidden":false,"merged":[[0,0,0,6],[2,0,4,6],[6,4,7,6]]}
["Current Income Continued"]
[]
["Do you have any other sources of income like a rental property or a regular bonus from work?  Any additional income can be entered below.  We've provided enough space to cover many different scenarios, but if these don't apply to you, feel free to leave them blank."]
[]
[]
[]
[null,null,null,null,"How many times per year do you receive this?"]
[null,null,null,"s Other Income"]
[null,null,"Bonus from job"]
[null,null,"Interest Earned"]
[null,null,"Rental Income #1"]
[null,null,"Other Income"]
[null,null,"Other Income"]

{"sheet":"Income Entry 4","index":5,"n_rows":13,"n_cols":5,"rows_kept":13,"cut":false,"hidden":false,"merged":[[0,0,0,6],[2,0,4,6],[6,4,7,6]]}
["Current Income Continued"]
[]
["Do you have any other sources of income like a rental property or a regular bonus from work?  Any additional income really can be entered below.  We've provided enough space to cover many different scenarios, but if these don't apply to you, feel free to leave them blank."]
[]
[]
[]
[null,null,null,null,"How many times per year do you receive this?"]
[null,null,null," "]
[null,null,"Bonus from job"]
[null,null,"Interest Earned"]
[null,null,"Rental Income #1"]
[null,null,"Other Income"]
[null,null,"Other Income"]

{"sheet":"Income Note","index":6,"n_rows":10,"n_cols":1,"rows_kept":10,"cut":false,"hidden":false,"merged":[[9,0,11,6],[0,0,0,6],[2,0,4,6],[6,0,7,6]]}
["Income Note"]
[]
["On the next screen, you will see a summary of all the income information you have entered so far. This information will be used as you make your monthly budget, so you’ll want to make sure that everything is correct."]
[]
[]
[]
["Corrections can be made by simply editing the Blue fields, or by clicking on the “Go to Income Entry” button near the bottom of the worksheet.\n"]
[]
[]
["Remember that if you do choose to make corrections, any of those changes will completely\nreplace the information you’ve already entered when you hit the “Save and Continue” button on the next screen."]

{"sheet":"Income Summary","index":7,"n_rows":33,"n_cols":9,"rows_kept":33,"cut":false,"hidden":false,"merged":[[30,0,30,1],[15,0,15,2],[0,8,0,9],[16,1,16,2],[23,1,23,2],[14,0,14,2],[0,0,0,7],[5,0,5,2]]}
["INCOME SUMMARY"]
[]
[null,null,null,null," ","Marital Status:"]
[null,null,"Pay periods per year: ",null,null,"Children:"]
[]
["SOURCES OF INCOME",null,null,"s Paycheck"," ","Monthly Total","Yearly Total"]
[null,"Gross Income",null,null,null,{"$f":"((D7*$D$4)+(E7*$E$4))/12","v":0},{"$f":"F7*12","v":0}]
[null,"Bonus",null,null,null,{"$f":"((D8*$D$4)+(E8*$E$4))/12","v":0},{"$f":"F8*12","v":0}]
[null,"Interest Earned",null,null,null,{"$f":"((D9*$D$4)+(E9*$E$4))/12","v":0},0]
[null,"Rental Income",null,null,null,{"$f":"((D10*$D$4)+(E10*$E$4))/12","v":0},0]
[null,"Other Income",null,null,null,{"$f":"((D11*$D$4)+(E11*$E$4))/12","v":0},0]
[null,"Other Income",null,null,null,0,{"$f":"F12*12","v":0}]
[null,null,"GROSS INCOME TOTALS",{"$f":"SUM(D7:D12)","v":0},{"$f":"SUM(E7:E12)","v":0},{"$f":"SUM(F7:F12)","v":0},{"$f":"SUM(G7:G12)","v":0},null,{"$f":"CONCATENATE(G3,G4)","v":""}]
[null,null,null,90,{"$f":"E13*E4","v":0}]
[]
["TAXES & WITHHOLDING",null,null,null," ","Monthly Total","Yearly Total","% of Gross"]
[null,"Social Security/PERS",null,null,null,{"$f":"((D17*$D$4)+(E17*$E$4))/12","v":0},{"$f":"F17*12","v":0},{"$f":"IFERROR((F17/$F$13),\"-\")","v":"-"}]
[null,"Medicare",null,null,null,{"$f":"((D18*$D$4)+(E18*$E$4))/12","v":0},{"$f":"F18*12","v":0},{"$f":"IFERROR((F18/$F$13),\"-\")","v":"-"}]
[null,"Federal",null,null,null,0,0,"-"]
[null,"State",null,null,null,0,0,"-"]
[null,"City / Local",null,null,null,0,0,"-"]
[null,"Dues",null,null,null,0,0,"-"]
[null,"401(k)/403(b)",null,null,null,0,0,"-"]
[null,"Pre-Tax SAVINGS",null,null,null,0,0,"-"]
[null,"HSA/FSA",null,null,null,0,0,"-"]
[null,"[Other]",null,null,null,0,0,"-"]
[null,"[Other]",null,null,null,0,0,"-"]
[null,"[Other]",null,null,null,0,0,"-"]
[null,"[Other]",null,null,null,0,0,"-"]
[null,null,"TOTAL TAXES & WITHHOLDING",{"$f":"SUM(D17:D29)","v":0},{"$f":"SUM(E17:E29)","v":0},0,{"$f":"SUM(G17:G29)","v":0},{"$f":"SUM(H17:H29)","v":0}]
[]
[null,null,null,"Per Pay Period","Per Pay Period","Monthly","Yearly"]
[null,null,"TOTAL NET INCOME",{"$f":"SUM(D13-D30)","v":0},{"$f":"SUM(E13-E30)","v":0},{"$f":"SUM(F13-F30)","v":0},{"$f":"SUM(G13-G30)","v":0}]

{"sheet":"Expense Entry 1","index":8,"n_rows":25,"n_cols":3,"rows_kept":25,"cut":false,"hidden":false,"merged":[[0,0,0,6],[8,0,10,6],[2,0,6,6],[12,1,12,3],[20,1,20,3]]}
["Current Expenses"]
[]
["For this next part, you'll want to have between 3 and 6 months of bank statements with you.  As you go through each of the categories, try to average what you have spent in each category per month.  Your paycheck information has already been entered, so only use your bank statements for these expense screens.  This will give you a general sense of where your money is reallygoing."]
[]
[]
[]
[]
[]
["Don't worry about analyzing what these numbers mean just yet. We'll have a section where you can see how your numbers look in context.  For now, just average your expenses and write them in.  Feel free to change the categories to better fit how you use your money."]
[]
[]
[]
[null,"GIVING:"]
[null,null,"GIVING PLEDGE"]
[null,null,"CHARITIES"]
[null,null,"MISSIONARIES"]
[null,null,"CHRISTMAS/BIRTHDAYS"]
[null,null,"[OTHER]"]
[]
[]
[null,"SAVING:"]
[null,null,"GENERAL"]
[null,null,"EDUCATION"]
[null,null,"RETIREMENT"]
[null,null,"[OTHER]"]

{"sheet":"Expense Entry 2","index":9,"n_rows":8,"n_cols":7,"rows_kept":8,"cut":false,"hidden":false,"merged":[[2,0,3,8],[4,1,4,8],[0,0,0,8]]}
["Debt Expenses"]
[]
["Now, you're going to summarize the debts you have.  It will help to have copies of your student loan information, car loans, credit card bills and statements.  The \"Debt Type\" column has a drop down menu that you can select from several options."]
[]
[null,"**Note:  Under the \"Current Payment\" column, write down what you are actually paying towards the loan.  If you're paying the minimums, just write in the minimum payment amount."]
[]
[]
[null,"Debt Name","Debt Type","Balance","Interest Rate","Minimum Payment","Current Payment"]

{"sheet":"Expense Entry 3","index":10,"n_rows":40,"n_cols":5,"rows_kept":40,"cut":false,"hidden":false,"merged":[[0,0,0,6],[2,0,6,6],[41,1,42,5]]}
["Living Expenses"]
[]
["Now you're going to average what your regular living expenses are.  Many of these purchases are non-discretionary, meaning that while you have some control over how much these will cost, you typically have very little say over whether or not you can buy it.  For example, while electric charges vary month-to-month you must still pay them.  Whereas, with a discretionary, like a music streaming subscription, you can choose not to purchase it.  We'll deal with more discretionary purchases in a minute.  Remember, you've already entered your paycheck information.  Just use bank statements here."]
[]
[]
[]
[]
[]
[null,"HOUSING:",null,null,"FOOD:"]
[null,"MORTGAGE/RENT",null,null,"GROCERIES"]
[null,"PROERTY TAXES",null,null,"RESTAURANTS"]
[null,"ELECTRICITY",null,null,"BARS/ALCOHOL"]
[null,"NATURAL GAS",null,null,"COFFEE SHOPS"]
[null,"WATER",null,null,"[OTHER]"]
[null,"CONDO FEE/HOA"]
[null,"CELLPHONES",null,null,"MEDICAL EXPENSES:"]
[null,"INTERNET/CABLE",null,null,"PHYSICIANS"]
[null,"CLEANING SERVICES",null,null,"DENTISTS"]
[null,"SEWER/TRASH",null,null,"PHARMACEUTICALS"]
[null,"REPAIRS/IMPROVEMENT",null,null,"VISION"]
[null,"FURNISHINGS",null,null,"[OTHER]"]
[null,"[OTHER]",null,null,"[OTHER]"]
[null,"[OTHER]"]
[null,null,null,null,"CHILDREN'S EXPENSES:"]
[null,"AUTO:",null,null,"TUITION"]
[null,"GASOLINE",null,null,"SCHOOL LUNCHES"]
[null,"MAINTENANCE & REPAIRS",null,null,"DAY CARE"]
[null,"PARKING/PUBLIC TRANSPORTATION",null,null,"ALLOWANCES"]
[null,"REGISTRATION/TAXES",null,null,"LESSONS"]
[null,"[OTHER]",null,null,"[OTHER]"]
[null,null,null,null,"[OTHER]"]
[null,"INSURANCE:"]
[null,"LIFE",null,null,"CLOTHING:"]
[null,"DISABILITY",null,null,"[CLOTHING OTHER]"]
[null,"HEALTH PREMIUM",null,null,"[CLOTHING OTHER]"]
[null,"AUTOMOBILE"]
[null,"HOUSEHOLD"]
[null,"EXCESS LIABILITY"]
[null,"[OTHER]"]
[null,"[OTHER]"]

{"sheet":"Expense Entry 4","index":11,"n_rows":30,"n_cols":3,"rows_kept":30,"cut":false,"hidden":false,"merged":[[0,0,0,6],[2,0,6,6]]}
["Living Expenses Continued"]
[]
["This section is for averaging what we call \"discretionary expenses\".  These are expenses that you largely have control over, and especially whether or not you want to continue to pay for them or cut them out of your budget entirely.  You don't have to make any decisions yet, so you can just average your expenses in each of these categories and enter these below."]
[]
[]
[]
[]
[]
[null,null,"ENTERTAINMENT:"]
[null,null,"EVENINGS OUT"]
[null,null,"BABY SITTERS"]
[null,null,"MEDIA SUBSCRIPTIONS"]
[null,null,"PAPER SUBSCRIPTIONS"]
[null,null,"DUES/CLUBS/ACTIVITIES"]
[null,null,"VACATIONS"]
[null,null,"[OTHER]"]
[null,null,"[OTHER]"]
[]
[]
[null,null,"MISCELLANEOUS:"]
[null,null,"TOILETRIES"]
[null,null,"DRY CLEANING"]
[null,null,"PROFESSIONAL FEES"]
[null,null,"ANIMALS"]
[null,null,"BEAUTY & BARBER"]
[null,null,"CASH ALLOWANCES"]
[null,null,"OTHER SERVICES"]
[null,null,"OTHER PURCHASES"]
[null,null,"[OTHER]"]
[null,null,"[OTHER]"]

{"sheet":"Expense Note","index":12,"n_rows":9,"n_cols":2,"rows_kept":9,"cut":false,"hidden":false,"merged":[[0,0,0,6],[2,0,7,6],[8,1,10,5]]}
["Expense Note"]
[]
["On the next screen, you will see a summary of all of the expense information that you entered.  This information will help you decide which areas may be problematic or which ones should be adjusted in your budget.  If you have any corrections to make, you can either enter those in the blue fields, or click the button at the bottom to take you through the entry screens again.  Don't be too focused on analyzing what these numbers mean.  We'll start our class session with looking at what they show us."]
[]
[]
[]
[]
[]
[null,"**Note:  If you do make corrections on the next screen, any changes you make will replace the information already entered as soon as you hit \"Save and Continue\"."]

{"sheet":"Expense Summary","index":13,"n_rows":116,"n_cols":3,"rows_kept":116,"cut":false,"hidden":false,"merged":[[0,1,0,3],[6,6,6,7]]}
[null,"Expense Summary "]
[]
[null,"GIFTS:"]
[null,"GIVING PLEDGE"]
[null,"CHARITIES"]
[null,"MISSIONARIES"]
[null,"CHRISTMAS/BIRTHDAYS"]
[null,"[OTHER]"]
[null,"TOTAL GIFTS",{"$f":"SUM(C4:C8)","v":0}]
[]
[null,"SAVINGS:"]
[null,"GENERAL"]
[null,"EDUCATION"]
[null,"RETIREMENT"]
[null,"[OTHER]"]
[null,"TOTAL SAVINGS",{"$f":"SUM(C12:C15)","v":0}]
[]
[null,"DEBT MINIMUMS:"]
[null,"EDUCATION LOANS"]
[null,"CREDIT CARDS/PERSONAL NOTES"]
[null,"[OTHER]"]
[null,"[OTHER]"]
[null,"TOTAL DEBT",{"$f":"SUM(C19:C22)","v":0}]
[]
[null,"HOUSING:"]
[null,"MORTGAGE/RENT"]
[null,"PROERTY TAXES"]
[null,"ELECTRICITY"]
[null,"NATURAL GAS"]
[null,"WATER"]
[null,"CONDO FEE/HOA"]
[null,"CELLPHONES"]
[null,"INTERNET/CABLE"]
[null,"CLEANING SERVICES"]
[null,"SEWER/TRASH"]
[null,"REPAIRS/IMPROVEMENT"]
[null,"FURNISHINGS"]
[null,"[OTHER]"]
[null,"[OTHER]"]
[null,"TOTAL HOUSING",{"$f":"SUM(C26:C39)","v":0}]
[]
[null,"AUTO:"]
[null,"GASOLINE"]
[null,"AUTO PAYMENTS/LEASE"]
[null,"MAINTENANCE & REPAIRS"]
[null,"PARKING/PUBLIC TRANSPORTATION"]
[null,"REGISTRATION/TAXES"]
[null,"[OTHER]"]
[null,"TOTAL TRANSPORTATION",{"$f":"SUM(C43:C48)","v":0}]
[]
[null,"INSURANCE:"]
[null,"LIFE"]
[null,"DISABILITY"]
[null,"HEALTH PREMIUM"]
[null,"AUTOMOBILE"]
[null,"HOUSEHOLD"]
[null,"EXCESS LIABILITY"]
[null,"[OTHER]"]
[null,"[OTHER]"]
[null,"TOTAL INSURANCE",{"$f":"SUM(C52:C59)","v":0}]
[]
[null,"FOOD:"]
[null,"GROCERIES"]
[null,"RESTAURANTS"]
[null,"BARS/ALCOHOL"]
[null,"COFFEE SHOPS"]
[null,"[OTHER]"]
[null,"TOTAL FOOD",{"$f":"SUM(C63:C67)","v":0}]
[]
[null,"MEDICAL EXPENSES:"]
[null,"PHYSICIANS"]
[null,"DENTISTS"]
[null,"PHARMACEUTICALS"]
[null,"VISION"]
[null,"[OTHER]"]
[null,"[OTHER]"]
[null,"TOTAL MEDICAL EXPENSES",{"$f":"SUM(C71:C76)","v":0}]
[]
[null,"CHILDREN'S EXPENSES:"]
[null,"TUITION"]
[null,"SCHOOL LUNCHES"]
[null,"DAY CARE"]
[null,"ALLOWANCES"]
[null,"LESSONS"]
[null,"[OTHER]"]
[null,"[OTHER]"]
[null,"TOTAL CHILDREN'S EXPENSES",{"$f":"SUM(C80:C86)","v":0}]
[]
[null,"CLOTHING:"]
[null,"[CLOTHING OTHER]"]
[null,"[CLOTHING OTHER]"]
[null,"TOTAL CLOTHING",{"$f":"SUM(C90:C91)","v":0}]
[]
[null,"ENTERTAINMENT:"]
[null,"EVENINGS OUT"]
[null,"BABY SITTERS"]
[null,"MEDIA SUBSCRIPTIONS"]
[null,"PAPER SUBSCRIPTIONS"]
[null,"DUES/CLUBS/ACTIVITIES"]
[null,"VACATIONS"]
[null,"[OTHER]"]
[null,"[OTHER]"]
[null,"TOTAL ENTERTAINMENT",{"$f":"SUM(C95:C102)","v":0}]
[]
[null,"MISCELLANEOUS:"]
[null,"TOILETRIES"]
[null,"DRY CLEANING"]
[null,"PROFESSIONAL FEES"]
[null,"ANIMALS"]
[null,"BEAUTY & BARBER"]
[null,"CASH ALLOWANCES"]
[null,"OTHER SERVICES"]
[null,"OTHER PURCHASES"]
[null,"[OTHER]"]
[null,"[OTHER]"]
[null,"TOTAL MISCELLANEOUS",{"$f":"SUM(C106:C115)","v":0}]

{"sheet":"Truths","index":14,"n_rows":25,"n_cols":3,"rows_kept":25,"cut":false,"hidden":false,"merged":[[0,0,0,6],[2,0,5,6],[11,0,11,6],[20,0,22,6],[17,1,17,6],[18,2,18,6]]}
["Setting Goals - Biblical Truths"]
[]
["Before we begin assessing and adjusting our finances, we need to consider what God says about our relationship to material resources like money.  These are just some of the over 2,300 verses addressing money, possessions, and stewardship.  Allowing these truths to deeply penetrate your hearts will help you to set and meet goals that are spiritually strong."]
[]
[]
[]
[]
["God owns everything.  He entrusts us to manage some of those resources."]
[]
[null,"Psalms 24:1; Haggai 2:8; 1 Peter 4:10; Matthew 25:14-30; Luke 16:2"]
[]
["God promises He will provide for all of our material needs."]
[]
[null,"Matthew 6:25-34; Phillipians 4:19"]
[]
["Our motives and attitudes in the area of finances are very important."]
[]
[null,"Proverbs 16:2; Mark 12:41-44; 2 Corinthians 9:7, 8;"]
[null,null,"  Hebrews 13:5; Phillipians 2:4-8"]
[]
["All economic activity (working, giving, savings, debt, spending, etc. . .) has eternal consequences and impacts our effectiveness in this life as well as the heavenly rewards we will receive."]
[]
[]
[]
[null,"Luke 16:10-13, Matthew 6:14-33"]

{"sheet":"Giving","index":15,"n_rows":36,"n_cols":5,"rows_kept":36,"cut":false,"hidden":false,"merged":[[27,0,29,6],[0,0,0,6],[2,0,4,6],[14,0,16,6],[20,0,23,6],[8,0,10,6]]}
["Setting Goals - Giving"]
[]
["God, being sacrificial in nature, wants us to imitate Him and be sacrificial with our resources. When we couple this with the truths on the previous page, we can be confident and secure in expressing our faith through giving sacrificially to His purposes.  "]
[]
[]
[]
[null,"Ephesians 5:2; Luke 6:36; Romans 8:32; Philippians 2:5-8"]
[]
["When we don't give, or when our motives from giving are improper (guilt, fear, obligation, self-aggrandizing), we limit God's ability to receive the glory He deserves.  When we give in faith, God is glorified before others and we are blessed in many different ways."]
[]
[]
[]
[null,"1 Peter 4:10-11; 2 Corinthians 9:7;  2 Corinthians 8:18-21"]
[]
["There are numerous ways to give that can glorify God.  In the Bible we find examples of giving to the poor, giving to people who teach the word of God, and giving to churches that are in need."]
[]
[]
[]
[null,"2 Corinthians 8 & 9; Galatians 6:6; Proverbs 11:25, 21:13; 1 Timothy 6 :17-19"]
[]
["The Bible instructs us to give from what we have, not while racking up consumer debt.  It also calls for our giving to be consistent, generous, and sacrificial, the same way that God provides for us.  Giving in this way will bring honor to God and increase our blessings and dependence on Him."]
[]
[]
[]
[]
[null,"2 Corinthians 8 & 9; 1 Corinthians 16:1-2"]
[]
["Take some time to pray through these passages and set some goals for your giving this coming year.  You don't have to use all of the goals below, instead decide in your heart and with God what you should be giving."]
[]
[]
[]
[null,null,"Amount",null,"How often per year?"]
[null,"Giving Pledge Goal"]
[null,"Charities Goal"]
[null,"Missionary Support Goal"]
[null,"Other Giving Goal"]

{"sheet":"Saving","index":16,"n_rows":29,"n_cols":5,"rows_kept":29,"cut":false,"hidden":false,"merged":[[8,0,11,6],[0,0,0,6],[2,0,5,6],[16,0,21,6]]}
["Setting Goals - Saving"]
[]
["While the Bible doesn't command believers to save money, it definitely encourages saving as a wise use of our resources.  To get a start on savings, we must first avoid the pitfall of the sluggard and the fool who use all of their resources and save nothing for the future."]
[]
[]
[]
[null,"Proverbs 6:6-11, 21:20, 13:11"]
[]
["When we accumulate savings or wealth out of a desire for pride or security, we will not be able to experience the lasting freedom that comes from trusting God with our wellbeing.  Our investment in spiritual things will pay a reward that is more certain than fluctuating markets."]
[]
[]
[]
[]
[null,"Matthew 6:19-21; Luke 12:16-21; 1 Timothy 6:17-19; "]
[null,null,"Mark 10:28-31; James 5:1-6 "]
[]
["It's important to save money each month to build strong savings habits.  We recommend having between 2-3 months' worth of expenses as an Emergency Savings fund.  This will help cover if something goes wrong, such as a job loss, unexpected car or house repair, or medical emergency.  But the amount that you want to save is between you and God.  They are His resources and when we have our security in God, we won't be afraid to give our savings away if he calls us to.  Below you can make some goals for your saving this year."]
[]
[]
[]
[]
[]
[]
[]
[null,null,"Amount",null,"How often per year?"]
[null,"   General"]
[null,"Education"]
[null,"Retirement"]
[null,"Other"]

{"sheet":"Debt","index":17,"n_rows":37,"n_cols":8,"rows_kept":37,"cut":false,"hidden":false,"merged":[[18,0,20,8],[2,0,4,8],[6,0,8,8],[11,0,14,8],[0,0,0,8]]}
["Setting Goals - Debt"]
[]
["“The borrower becomes the lender's slave.”  This is not a new slogan, but rather Scripture written over 2,500 years ago by Solomon (Proverbs 22:7).  The enslavement to debt is one of the biggest obstacles to financial freedom and ability to give.  The Bible does not specifically prohibit the use of credit, but warns us of its dangers."]
[]
[]
[]
["Often, we assume that we will have the money in the future to pay for the things that we buy with credit now.  God has given us a provision to live on and be content with; but paying for things with money outside of that provision could indicate a desire to accumulate goods in this life."]
[]
[]
[null,"Luke 12:15; Philippians 4:10-13"]
[]
["Paying for things with credit can short circuit the trust that God is trying to build in our hearts.  Credit is an easy way to fuel sin areas like greed, self-indulgence, impatience, fear, poor self-esteem, envy, or discontentment because it can be an immediate release to the tension we feel between the Spirit and the Flesh.  Rather than waiting on God's timing and resources, we take matters into our own hands.  God wants us to be able to trust in His provision and His timing for the things we need in our lives."]
[]
[]
[]
[]
[null,"1 Timothy 6:6-10; Matthew 6:25-34"]
[]
["Debt is easy to get into and hard to escape.  So when we decide to go into legitimate debt (e.g., for school or a home) make the decision very carefully and evaluate your needs in light of what God says in Scripture.  Since poor or uninformed decisions can affect your future so adversely, don’t let excessive debt ruin the freedom God wants you to experience."]
[]
[]
[]
["Take some time to make some goals for your debt repayment below:"]
[]
[null,"Debt Name","Debt Type","Balance","Interest Rate","Minimum Payment","Current Payment","Goal Payment"]
[null,{"$f":"IF('Expense Entry 2'!B9=0,\"\", 'Expense Entry 2'!B9)","v":""},{"$f":"IF('Expense Entry 2'!C9=0,\"\", 'Expense Entry 2'!C9)","v":""},{"$f":"IF('Expense Entry 2'!D9=0,\"\", 'Expense Entry 2'!D9)","v":""},{"$f":"IF('Expense Entry 2'!E9=0,\"\", 'Expense Entry 2'!E9)","v":""},{"$f":"IF('Expense Entry 2'!F9=0,\"\", 'Expense Entry 2'!F9)","v":""},{"$f":"IF('Expense Entry 2'!G9=0,\"\", 'Expense Entry 2'!G9)","v":""}]
[null,{"$f":"IF('Expense Entry 2'!B10=0,\"\", 'Expense Entry 2'!B10)","v":""},{"$f":"IF('Expense Entry 2'!C10=0,\"\", 'Expense Entry 2'!C10)","v":""},{"$f":"IF('Expense Entry 2'!D10=0,\"\", 'Expense Entry 2'!D10)","v":""},{"$f":"IF('Expense Entry 2'!E10=0,\"\", 'Expense Entry 2'!E10)","v":""},{"$f":"IF('Expense Entry 2'!F10=0,\"\", 'Expense Entry 2'!F10)","v":""},{"$f":"IF('Expense Entry 2'!G10=0,\"\", 'Expense Entry 2'!G10)","v":""}]
[null,{"$f":"IF('Expense Entry 2'!B11=0,\"\", 'Expense Entry 2'!B11)","v":""},{"$f":"IF('Expense Entry 2'!C11=0,\"\", 'Expense Entry 2'!C11)","v":""},{"$f":"IF('Expense Entry 2'!D11=0,\"\", 'Expense Entry 2'!D11)","v":""},{"$f":"IF('Expense Entry 2'!E11=0,\"\", 'Expense Entry 2'!E11)","v":""},{"$f":"IF('Expense Entry 2'!F11=0,\"\", 'Expense Entry 2'!F11)","v":""},{"$f":"IF('Expense Entry 2'!G11=0,\"\", 'Expense Entry 2'!G11)","v":""}]
[null,{"$f":"IF('Expense Entry 2'!B12=0,\"\", 'Expense Entry 2'!B12)","v":""},{"$f":"IF('Expense Entry 2'!C12=0,\"\", 'Expense Entry 2'!C12)","v":""},{"$f":"IF('Expense Entry 2'!D12=0,\"\", 'Expense Entry 2'!D12)","v":""},{"$f":"IF('Expense Entry 2'!E12=0,\"\", 'Expense Entry 2'!E12)","v":""},{"$f":"IF('Expense Entry 2'!F12=0,\"\", 'Expense Entry 2'!F12)","v":""},{"$f":"IF('Expense Entry 2'!G12=0,\"\", 'Expense Entry 2'!G12)","v":""}]
[null,{"$f":"IF('Expense Entry 2'!B13=0,\"\", 'Expense Entry 2'!B13)","v":""},{"$f":"IF('Expense Entry 2'!C13=0,\"\", 'Expense Entry 2'!C13)","v":""},{"$f":"IF('Expense Entry 2'!D13=0,\"\", 'Expense Entry 2'!D13)","v":""},{"$f":"IF('Expense Entry 2'!E13=0,\"\", 'Expense Entry 2'!E13)","v":""},{"$f":"IF('Expense Entry 2'!F13=0,\"\", 'Expense Entry 2'!F13)","v":""},{"$f":"IF('Expense Entry 2'!G13=0,\"\", 'Expense Entry 2'!G13)","v":""}]
[null,{"$f":"IF('Expense Entry 2'!B14=0,\"\", 'Expense Entry 2'!B14)","v":""},{"$f":"IF('Expense Entry 2'!C14=0,\"\", 'Expense Entry 2'!C14)","v":""},{"$f":"IF('Expense Entry 2'!D14=0,\"\", 'Expense Entry 2'!D14)","v":""},{"$f":"IF('Expense Entry 2'!E14=0,\"\", 'Expense Entry 2'!E14)","v":""},{"$f":"IF('Expense Entry 2'!F14=0,\"\", 'Expense Entry 2'!F14)","v":""},{"$f":"IF('Expense Entry 2'!G14=0,\"\", 'Expense Entry 2'!G14)","v":""}]
[null,{"$f":"IF('Expense Entry 2'!B15=0,\"\", 'Expense Entry 2'!B15)","v":""},{"$f":"IF('Expense Entry 2'!C15=0,\"\", 'Expense Entry 2'!C15)","v":""},{"$f":"IF('Expense Entry 2'!D15=0,\"\", 'Expense Entry 2'!D15)","v":""},{"$f":"IF('Expense Entry 2'!E15=0,\"\", 'Expense Entry 2'!E15)","v":""},{"$f":"IF('Expense Entry 2'!F15=0,\"\", 'Expense Entry 2'!F15)","v":""},{"$f":"IF('Expense Entry 2'!G15=0,\"\", 'Expense Entry 2'!G15)","v":""}]
[null,{"$f":"IF('Expense Entry 2'!B16=0,\"\", 'Expense Entry 2'!B16)","v":""},{"$f":"IF('Expense Entry 2'!C16=0,\"\", 'Expense Entry 2'!C16)","v":""},{"$f":"IF('Expense Entry 2'!D16=0,\"\", 'Expense Entry 2'!D16)","v":""},{"$f":"IF('Expense Entry 2'!E16=0,\"\", 'Expense Entry 2'!E16)","v":""},{"$f":"IF('Expense Entry 2'!F16=0,\"\", 'Expense Entry 2'!F16)","v":""},{"$f":"IF('Expense Entry 2'!G16=0,\"\", 'Expense Entry 2'!G16)","v":""}]
[null,{"$f":"IF('Expense Entry 2'!B17=0,\"\", 'Expense Entry 2'!B17)","v":""},{"$f":"IF('Expense Entry 2'!C17=0,\"\", 'Expense Entry 2'!C17)","v":""},{"$f":"IF('Expense Entry 2'!D17=0,\"\", 'Expense Entry 2'!D17)","v":""},{"$f":"IF('Expense Entry 2'!E17=0,\"\", 'Expense Entry 2'!E17)","v":""},{"$f":"IF('Expense Entry 2'!F17=0,\"\", 'Expense Entry 2'!F17)","v":""},{"$f":"IF('Expense Entry 2'!G17=0,\"\", 'Expense Entry 2'!G17)","v":""}]
[null,{"$f":"IF('Expense Entry 2'!B18=0,\"\", 'Expense Entry 2'!B18)","v":""},{"$f":"IF('Expense Entry 2'!C18=0,\"\", 'Expense Entry 2'!C18)","v":""},{"$f":"IF('Expense Entry 2'!D18=0,\"\", 'Expense Entry 2'!D18)","v":""},{"$f":"IF('Expense Entry 2'!E18=0,\"\", 'Expense Entry 2'!E18)","v":""},{"$f":"IF('Expense Entry 2'!F18=0,\"\", 'Expense Entry 2'!F18)","v":""},{"$f":"IF('Expense Entry 2'!G18=0,\"\", 'Expense Entry 2'!G18)","v":""}]
[null,{"$f":"IF('Expense Entry 2'!B19=0,\"\", 'Expense Entry 2'!B19)","v":""},{"$f":"IF('Expense Entry 2'!C19=0,\"\", 'Expense Entry 2'!C19)","v":""},{"$f":"IF('Expense Entry 2'!D19=0,\"\", 'Expense Entry 2'!D19)","v":""},{"$f":"IF('Expense Entry 2'!E19=0,\"\", 'Expense Entry 2'!E19)","v":""},{"$f":"IF('Expense Entry 2'!F19=0,\"\", 'Expense Entry 2'!F19)","v":""},{"$f":"IF('Expense Entry 2'!G19=0,\"\", 'Expense Entry 2'!G19)","v":""}]
[null,{"$f":"IF('Expense Entry 2'!B20=0,\"\", 'Expense Entry 2'!B20)","v":""},{"$f":"IF('Expense Entry 2'!C20=0,\"\", 'Expense Entry 2'!C20)","v":""},{"$f":"IF('Expense Entry 2'!D20=0,\"\", 'Expense Entry 2'!D20)","v":""},{"$f":"IF('Expense Entry 2'!E20=0,\"\", 'Expense Entry 2'!E20)","v":""},{"$f":"IF('Expense Entry 2'!F20=0,\"\", 'Expense Entry 2'!F20)","v":""},{"$f":"IF('Expense Entry 2'!G20=0,\"\", 'Expense Entry 2'!G20)","v":""}]

{"sheet":"Goals Summary","index":18,"n_rows":35,"n_cols":5,"rows_kept":35,"cut":false,"hidden":false,"merged":[[0,0,0,6],[2,0,5,16383],[34,0,35,6],[25,2,25,4]]}
["Setting Goals - Summary"]
[]
["Here is a summary of all the goals that you just filled out.  It's helpful to keep these goals in your mind as you go through the budgeting and recording process so that you don't lose sight of what your priorities really are; even if you can't afford to meet all of the goals you'd like to."]
[]
[]
[]
[]
[null,null,null,"Giving"]
[]
[null,null,null,"Per Year","Per Month"]
[null,null,"Giving Pledge Goal",{"$f":"IF(Giving!C33=0, \"\",Giving!C33*Giving!E33)","v":""},{"$f":"IF(Giving!C33=0, \"\",((Giving!C33*Giving!E33)/12))","v":""}]
[null,null,"Charities Goal",{"$f":"IF(Giving!C34=0, \"\",Giving!C34*Giving!E34)","v":""},{"$f":"IF(Giving!C34=0, \"\",((Giving!C34*Giving!E34)/12))","v":""}]
[null,null,"Missionary Support Goal",{"$f":"IF(Giving!C35=0, \"\",Giving!C35*Giving!E35)","v":""},{"$f":"IF(Giving!C35=0, \"\",((Giving!C35*Giving!E35)/12))","v":""}]
[null,null,"Other Giving Goal",{"$f":"IF(Giving!C36=0, \"\",Giving!C36*Giving!E36)","v":""},{"$f":"IF(Giving!C36=0, \"\",((Giving!C36*Giving!E36)/12))","v":""}]
[]
[]
[null,null,null,"Saving"]
[]
[null,null,null,"Per Year","Per Month"]
[null,null,"   General",{"$f":"IF(Saving!C26=0, \"\",Saving!C26*Saving!E26)","v":""},{"$f":"IF(Saving!C26=0, \"\",((Saving!C26*Saving!E26)/12))","v":""}]
[null,null,"Education",{"$f":"IF(Saving!C27=0, \"\",Saving!C27*Saving!E27)","v":""},{"$f":"IF(Saving!C27=0, \"\",((Saving!C27*Saving!E27)/12))","v":""}]
[null,null,"Retirement",{"$f":"IF(Saving!C28=0, \"\",Saving!C28*Saving!E28)","v":""},{"$f":"IF(Saving!C28=0, \"\",((Saving!C28*Saving!E28)/12))","v":""}]
[null,null,"Other",{"$f":"IF(Saving!C29=0, \"\",Saving!C29*Saving!E29)","v":""},{"$f":"IF(Saving!C29=0, \"\",((Saving!C29*Saving!E29)/12))","v":""}]
[]
[]
[null,null,"Debt Repayment"]
[]
[null,null,null,"Per Year","Per Month"]
[null,null,"Education Loans",{"$f":"IF(SUMIF(Debt!C26:C37,\"Education Loans\",Debt!H26:H37)=0, \"\",SUMIF(Debt!C26:C37,\"Education Loans\",Debt!H26:H37)*12)","v":""},{"$f":"IF(SUMIF(Debt!C26:C37,\"Education Loans\",Debt!H26:H37)=0, \"\",(SUMIF(Debt!C26:C37,\"Education Loans\",Debt!H26:H37)))","v":""}]
[null,null,"Credit Cards/Personal Notes",{"$f":"IF(SUMIF(Debt!C26:C37,\"Credit Cards\",Debt!H26:H37)=0, \"\",SUMIF(Debt!C26:C37,\"Credit Cards\",Debt!H26:H37)*12)","v":""},{"$f":"IF(SUMIF(Debt!C26:C37,\"Credit Cards\",Debt!H26:H37)=0, \"\",(SUMIF(Debt!C26:C37,\"Credit Cards\",Debt!H26:H37)))","v":""}]
[null,null,"Auto Loans",{"$f":"IF(SUMIF(Debt!C26:C37,\"Auto Loans\",Debt!H26:H37)=0, \"\",SUMIF(Debt!C26:C37,\"Auto Loans\",Debt!H26:H37)*12)","v":""},{"$f":"IF(SUMIF(Debt!C26:C37,\"Auto Loans\",Debt!H26:H37)=0, \"\",(SUMIF(Debt!C26:C37,\"Auto Loans\",Debt!H26:H37)))","v":""}]
[null,null,"Other",{"$f":"IF(SUMIF(Debt!C26:C37,\"Other\",Debt!H26:H37)=0, \"\",SUMIF(Debt!C26:C37,\"Other\",Debt!H26:H37)*12)","v":""},{"$f":"IF(SUMIF(Debt!C26:C37,\"Other\",Debt!H26:H37)=0, \"\",(SUMIF(Debt!C26:C37,\"Other\",Debt!H26:H37)))","v":""}]
[]
[]
["This concludes the homework portion for the class.  If you're not taking a live session class,  feel free to continue through the rest of the workbook."]

{"sheet":"Spending Analysis Note","index":19,"n_rows":17,"n_cols":2,"rows_kept":17,"cut":false,"hidden":false,"merged":[[0,0,0,6],[2,0,7,6],[16,0,19,6],[9,0,11,6],[12,1,12,6],[13,1,13,6],[14,1,14,6]]}
["Expense"]
[]
["On the next screen, you will see another summary of all the expense information that you entered.  This time, however, you will also see a percentage guide next to each category.  These percentages will give you a rough recommendation for how much of your total (gross) income you should be spending in each area.  Percentages are subjective, since situations and values change from person to person, but they can be a good marker to take a deeper look at a specific area."]
[]
[]
[]
[]
[]
[]
["At the bottom, you will also see a summary of your total (gross) income, your taxes/withholding, and your expenses.  Finally, you will see a number in Red, Green or Yellow."]
[]
[]
[null,"-Red indicates that you're spending more money than you're making"]
[null,"-Green means that you still have money left over in your budget"]
[null,"-Yellow means that you're spending exactly what you bring in"]
[]
["If you see a mistake and need to make changes to this sheet, you can use the buttons to work back through the income and expenses section.  Resist the temptation to adjust your spending just to see a Green number at the bottom.  You should strive to be accurate in your current spending so you can properly analyze your financial situation."]

{"sheet":"Current Spending Analysis","index":20,"n_rows":125,"n_cols":7,"rows_kept":125,"cut":false,"hidden":false,"merged":[[0,0,0,2],[6,5,6,6]]}
["Current Spending Analysis"]
[null,"Current Spending","% of Gross"]
["GIFTS:"]
[{"$f":"IF('Expense Summary'!B4=0,\"\", 'Expense Summary'!B4)","v":"GIVING PLEDGE"},{"$f":"IF('Expense Summary'!C4=0,\"\", 'Expense Summary'!C4)","v":""}]
[{"$f":"IF('Expense Summary'!B5=0,\"\", 'Expense Summary'!B5)","v":"CHARITIES"},{"$f":"IF('Expense Summary'!C5=0,\"\", 'Expense Summary'!C5)","v":""}]
[{"$f":"IF('Expense Summary'!B6=0,\"\", 'Expense Summary'!B6)","v":"MISSIONARIES"},{"$f":"IF('Expense Summary'!C6=0,\"\", 'Expense Summary'!C6)","v":""}]
[{"$f":"IF('Expense Summary'!B7=0,\"\", 'Expense Summary'!B7)","v":"CHRISTMAS/BIRTHDAYS"},{"$f":"IF('Expense Summary'!C7=0,\"\", 'Expense Summary'!C7)","v":""},null,null,null,"Spending Guide"]
[{"$f":"IF('Expense Summary'!B8=0,\"\", 'Expense Summary'!B8)","v":"[OTHER]"},{"$f":"IF('Expense Summary'!C8=0,\"\", 'Expense Summary'!C8)","v":""},{"$f":"F11 & \" Target\"","v":{"$error":"#REF!"}},null,{"$f":"'Spending Guides'!$A$4","v":"Income Level"},{"$f":"IF('Income Summary'!$G$13<20000,(HLOOKUP(20001,INDIRECT('Spending Guides'!$A$1),1,TRUE)),(HLOOKUP('Income Summary'!$G$13,INDIRECT('Spending Guides'!$A$1),1,TRUE)))","v":{"$error":"#REF!"}},{"$f":"IF('Income Summary'!$G$13<100000,HLOOKUP(('Income Summary'!$G$13+10000),INDIRECT('Spending Guides'!$A$1),1,TRUE),HLOOKUP('Income Summary'!$G$13+20000,INDIRECT('Spending Guides'!$A$1),1,TRUE))","v":{"$error":"#REF!"}}]
["TOTAL GIFTS",{"$f":"SUM(B4:B8)","v":0},{"$f":"IFERROR((B9/'Income Summary'!$F$13),\"0.00%\")","v":"0.00%"}]
[null,null,null,null,{"$f":"'Spending Guides'!$A$6","v":" Taxes"},{"$f":"IF('Income Summary'!$G$13<20000,(HLOOKUP(20001,INDIRECT('Spending Guides'!$A$1),3,TRUE)),(HLOOKUP('Income Summary'!$G$13,INDIRECT('Spending Guides'!$A$1),3,TRUE)))","v":{"$error":"#REF!"}},{"$f":"IF('Income Summary'!$G$13<100000,HLOOKUP(('Income Summary'!$G$13+10000),INDIRECT('Spending Guides'!$A$1),3,TRUE),HLOOKUP('Income Summary'!$G$13+20000,INDIRECT('Spending Guides'!$A$1),3,TRUE))","v":{"$error":"#REF!"}}]
["SAVINGS:",null,null,null,{"$f":"'Spending Guides'!$A$7","v":" Giving"},{"$f":"IF('Income Summary'!$G$13<20000,(HLOOKUP(20001,INDIRECT('Spending Guides'!$A$1),4,TRUE)),(HLOOKUP('Income Summary'!$G$13,INDIRECT('Spending Guides'!$A$1),4,TRUE)))","v":{"$error":"#REF!"}},{"$f":"IF('Income Summary'!$G$13<100000,HLOOKUP(('Income Summary'!$G$13+10000),INDIRECT('Spending Guides'!$A$1),4,TRUE),HLOOKUP('Income Summary'!$G$13+20000,INDIRECT('Spending Guides'!$A$1),4,TRUE))","v":{"$error":"#REF!"}}]
[{"$f":"IF('Expense Summary'!B12=0,\"\", 'Expense Summary'!B12)","v":"GENERAL"},{"$f":"IF('Expense Summary'!C12=0,\"\", 'Expense Summary'!C12)","v":""},null,null,{"$f":"'Spending Guides'!$A$8","v":" Savings"},{"$f":"IF('Income Summary'!$G$13<20000,(HLOOKUP(20001,INDIRECT('Spending Guides'!$A$1),5,TRUE)),(HLOOKUP('Income Summary'!$G$13,INDIRECT('Spending Guides'!$A$1),5,TRUE)))","v":{"$error":"#REF!"}},{"$f":"IF('Income Summary'!$G$13<100000,HLOOKUP(('Income Summary'!$G$13+10000),INDIRECT('Spending Guides'!$A$1),5,TRUE),HLOOKUP('Income Summary'!$G$13+20000,INDIRECT('Spending Guides'!$A$1),5,TRUE))","v":{"$error":"#REF!"}}]
[{"$f":"IF('Expense Summary'!B13=0,\"\", 'Expense Summary'!B13)","v":"EDUCATION"},{"$f":"IF('Expense Summary'!C13=0,\"\", 'Expense Summary'!C13)","v":""},null,null,{"$f":"'Spending Guides'!$A$9","v":" Debt (non mortgage)"},{"$f":"IF('Income Summary'!$G$13<20000,(HLOOKUP(20001,INDIRECT('Spending Guides'!$A$1),6,TRUE)),(HLOOKUP('Income Summary'!$G$13,INDIRECT('Spending Guides'!$A$1),6,TRUE)))","v":{"$error":"#REF!"}},{"$f":"IF('Income Summary'!$G$13<100000,HLOOKUP(('Income Summary'!$G$13+10000),INDIRECT('Spending Guides'!$A$1),6,TRUE),HLOOKUP('Income Summary'!$G$13+20000,INDIRECT('Spending Guides'!$A$1),6,TRUE))","v":{"$error":"#REF!"}}]
[{"$f":"IF('Expense Summary'!B14=0,\"\", 'Expense Summary'!B14)","v":"RETIREMENT"},{"$f":"IF('Expense Summary'!C14=0,\"\", 'Expense Summary'!C14)","v":""}]
[{"$f":"IF('Expense Summary'!B15=0,\"\", 'Expense Summary'!B15)","v":"[OTHER]"},{"$f":"IF('Expense Summary'!C15=0,\"\", 'Expense Summary'!C15)","v":""},{"$f":"F12 & \" Target\"","v":{"$error":"#REF!"}},null,{"$f":"'Spending Guides'!$A$11","v":" Housing"},{"$f":"IF('Income Summary'!$G$13<20000,(HLOOKUP(20001,INDIRECT('Spending Guides'!$A$1),8,TRUE)),(HLOOKUP('Income Summary'!$G$13,INDIRECT('Spending Guides'!$A$1),8,TRUE)))","v":{"$error":"#REF!"}},{"$f":"IF('Income Summary'!$G$13<100000,HLOOKUP(('Income Summary'!$G$13+10000),INDIRECT('Spending Guides'!$A$1),8,TRUE),HLOOKUP('Income Summary'!$G$13+20000,INDIRECT('Spending Guides'!$A$1),8,TRUE))","v":{"$error":"#REF!"}}]
["TOTAL SAVINGS",{"$f":"SUM(B12:B15)","v":0},{"$f":"IFERROR((B16/'Income Summary'!$F$13),\"0.00%\")","v":"0.00%"},null,{"$f":"'Spending Guides'!$A$12","v":" Auto"},{"$f":"IF('Income Summary'!$G$13<20000,(HLOOKUP(20001,INDIRECT('Spending Guides'!$A$1),9,TRUE)),(HLOOKUP('Income Summary'!$G$13,INDIRECT('Spending Guides'!$A$1),9,TRUE)))","v":{"$error":"#REF!"}},{"$f":"IF('Income Summary'!$G$13<100000,HLOOKUP(('Income Summary'!$G$13+10000),INDIRECT('Spending Guides'!$A$1),9,TRUE),HLOOKUP('Income Summary'!$G$13+20000,INDIRECT('Spending Guides'!$A$1),9,TRUE))","v":{"$error":"#REF!"}}]
[null,null,null,null,{"$f":"'Spending Guides'!$A$13","v":" Insurance"},{"$f":"IF('Income Summary'!$G$13<20000,(HLOOKUP(20001,INDIRECT('Spending Guides'!$A$1),10,TRUE)),(HLOOKUP('Income Summary'!$G$13,INDIRECT('Spending Guides'!$A$1),10,TRUE)))","v":{"$error":"#REF!"}},{"$f":"IF('Income Summary'!$G$13<100000,HLOOKUP(('Income Summary'!$G$13+10000),INDIRECT('Spending Guides'!$A$1),10,TRUE),HLOOKUP('Income Summary'!$G$13+20000,INDIRECT('Spending Guides'!$A$1),10,TRUE))","v":{"$error":"#REF!"}}]
["DEBT MINIMUMS:",null,null,null,{"$f":"'Spending Guides'!$A$14","v":" Food"},{"$f":"IF('Income Summary'!$G$13<20000,(HLOOKUP(20001,INDIRECT('Spending Guides'!$A$1),11,TRUE)),(HLOOKUP('Income Summary'!$G$13,INDIRECT('Spending Guides'!$A$1),11,TRUE)))","v":{"$error":"#REF!"}},{"$f":"IF('Income Summary'!$G$13<100000,HLOOKUP(('Income Summary'!$G$13+10000),INDIRECT('Spending Guides'!$A$1),11,TRUE),HLOOKUP('Income Summary'!$G$13+20000,INDIRECT('Spending Guides'!$A$1),11,TRUE))","v":{"$error":"#REF!"}}]
[{"$f":"IF('Expense Summary'!B19=0,\"\", 'Expense Summary'!B19)","v":"EDUCATION LOANS"},{"$f":"IF('Expense Summary'!C19=0,\"\", 'Expense Summary'!C19)","v":""},null,null,{"$f":"'Spending Guides'!$A$15","v":" Medical"},{"$f":"IF('Income Summary'!$G$13<20000,(HLOOKUP(20001,INDIRECT('Spending Guides'!$A$1),12,TRUE)),(HLOOKUP('Income Summary'!$G$13,INDIRECT('Spending Guides'!$A$1),12,TRUE)))","v":{"$error":"#REF!"}},{"$f":"IF('Income Summary'!$G$13<100000,HLOOKUP(('Income Summary'!$G$13+10000),INDIRECT('Spending Guides'!$A$1),12,TRUE),HLOOKUP('Income Summary'!$G$13+20000,INDIRECT('Spending Guides'!$A$1),12,TRUE))","v":{"$error":"#REF!"}}]
[{"$f":"IF('Expense Summary'!B20=0,\"\", 'Expense Summary'!B20)","v":"CREDIT CARDS/PERSONAL NOTES"},{"$f":"IF('Expense Summary'!C20=0,\"\", 'Expense Summary'!C20)","v":""},null,null,{"$f":"'Spending Guides'!$A$16","v":" Children"},{"$f":"IF('Income Summary'!$G$13<20000,(HLOOKUP(20001,INDIRECT('Spending Guides'!$A$1),13,TRUE)),(HLOOKUP('Income Summary'!$G$13,INDIRECT('Spending Guides'!$A$1),13,TRUE)))","v":{"$error":"#REF!"}},{"$f":"IF('Income Summary'!$G$13<100000,HLOOKUP(('Income Summary'!$G$13+10000),INDIRECT('Spending Guides'!$A$1),13,TRUE),HLOOKUP('Income Summary'!$G$13+20000,INDIRECT('Spending Guides'!$A$1),13,TRUE))","v":{"$error":"#REF!"}}]
[{"$f":"IF('Expense Summary'!B21=0,\"\", 'Expense Summary'!B21)","v":"[OTHER]"},{"$f":"IF('Expense Summary'!C21=0,\"\", 'Expense Summary'!C21)","v":""},null,null,{"$f":"'Spending Guides'!$A$17","v":" Clothing"},{"$f":"IF('Income Summary'!$G$13<20000,(HLOOKUP(20001,INDIRECT('Spending Guides'!$A$1),14,TRUE)),(HLOOKUP('Income Summary'!$G$13,INDIRECT('Spending Guides'!$A$1),14,TRUE)))","v":{"$error":"#REF!"}},{"$f":"IF('Income Summary'!$G$13<100000,HLOOKUP(('Income Summary'!$G$13+10000),INDIRECT('Spending Guides'!$A$1),14,TRUE),HLOOKUP('Income Summary'!$G$13+20000,INDIRECT('Spending Guides'!$A$1),14,TRUE))","v":{"$error":"#REF!"}}]
[{"$f":"IF('Expense Summary'!B22=0,\"\", 'Expense Summary'!B22)","v":"[OTHER]"},{"$f":"IF('Expense Summary'!C22=0,\"\", 'Expense Summary'!C22)","v":""},{"$f":"F13 & \" Target\"","v":{"$error":"#REF!"}},null,{"$f":"'Spending Guides'!$A$18","v":"Entertainment"},{"$f":"IF('Income Summary'!$G$13<20000,(HLOOKUP(20001,INDIRECT('Spending Guides'!$A$1),15,TRUE)),(HLOOKUP('Income Summary'!$G$13,INDIRECT('Spending Guides'!$A$1),15,TRUE)))","v":{"$error":"#REF!"}},{"$f":"IF('Income Summary'!$G$13<100000,HLOOKUP(('Income Summary'!$G$13+10000),INDIRECT('Spending Guides'!$A$1),15,TRUE),HLOOKUP('Income Summary'!$G$13+20000,INDIRECT('Spending Guides'!$A$1),15,TRUE))","v":{"$error":"#REF!"}}]
["TOTAL DEBT",{"$f":"SUM(B19:B22)","v":0},{"$f":"IFERROR((B23/'Income Summary'!$F$13),\"0.00%\")","v":"0.00%"},null,{"$f":"'Spending Guides'!$A$19","v":" Misc."},{"$f":"IF('Income Summary'!$G$13<20000,(HLOOKUP(20001,INDIRECT('Spending Guides'!$A$1),16,TRUE)),(HLOOKUP('Income Summary'!$G$13,INDIRECT('Spending Guides'!$A$1),16,TRUE)))","v":{"$error":"#REF!"}},{"$f":"IF('Income Summary'!$G$13<100000,HLOOKUP(('Income Summary'!$G$13+10000),INDIRECT('Spending Guides'!$A$1),16,TRUE),HLOOKUP('Income Summary'!$G$13+20000,INDIRECT('Spending Guides'!$A$1),16,TRUE))","v":{"$error":"#REF!"}}]
[]
["HOUSING:"]
[{"$f":"IF('Expense Summary'!B26=0,\"\", 'Expense Summary'!B26)","v":"MORTGAGE/RENT"},{"$f":"IF('Expense Summary'!C26=0,\"\", 'Expense Summary'!C26)","v":""}]
[{"$f":"IF('Expense Summary'!B27=0,\"\", 'Expense Summary'!B27)","v":"PROERTY TAXES"},{"$f":"IF('Expense Summary'!C27=0,\"\", 'Expense Summary'!C27)","v":""}]
[{"$f":"IF('Expense Summary'!B28=0,\"\", 'Expense Summary'!B28)","v":"ELECTRICITY"},{"$f":"IF('Expense Summary'!C28=0,\"\", 'Expense Summary'!C28)","v":""}]
[{"$f":"IF('Expense Summary'!B29=0,\"\", 'Expense Summary'!B29)","v":"NATURAL GAS"},{"$f":"IF('Expense Summary'!C29=0,\"\", 'Expense Summary'!C29)","v":""}]
[{"$f":"IF('Expense Summary'!B30=0,\"\", 'Expense Summary'!B30)","v":"WATER"},{"$f":"IF('Expense Summary'!C30=0,\"\", 'Expense Summary'!C30)","v":""}]
[{"$f":"IF('Expense Summary'!B31=0,\"\", 'Expense Summary'!B31)","v":"CONDO FEE/HOA"},{"$f":"IF('Expense Summary'!C31=0,\"\", 'Expense Summary'!C31)","v":""}]
[{"$f":"IF('Expense Summary'!B32=0,\"\", 'Expense Summary'!B32)","v":"CELLPHONES"},{"$f":"IF('Expense Summary'!C32=0,\"\", 'Expense Summary'!C32)","v":""}]
[{"$f":"IF('Expense Summary'!B33=0,\"\", 'Expense Summary'!B33)","v":"INTERNET/CABLE"},{"$f":"IF('Expense Summary'!C33=0,\"\", 'Expense Summary'!C33)","v":""}]
[{"$f":"IF('Expense Summary'!B34=0,\"\", 'Expense Summary'!B34)","v":"CLEANING SERVICES"},{"$f":"IF('Expense Summary'!C34=0,\"\", 'Expense Summary'!C34)","v":""}]
[{"$f":"IF('Expense Summary'!B35=0,\"\", 'Expense Summary'!B35)","v":"SEWER/TRASH"},{"$f":"IF('Expense Summary'!C35=0,\"\", 'Expense Summary'!C35)","v":""}]
[{"$f":"IF('Expense Summary'!B36=0,\"\", 'Expense Summary'!B36)","v":"REPAIRS/IMPROVEMENT"},{"$f":"IF('Expense Summary'!C36=0,\"\", 'Expense Summary'!C36)","v":""}]
[{"$f":"IF('Expense Summary'!B37=0,\"\", 'Expense Summary'!B37)","v":"FURNISHINGS"},{"$f":"IF('Expense Summary'!C37=0,\"\", 'Expense Summary'!C47)","v":""}]
[{"$f":"IF('Expense Summary'!B38=0,\"\", 'Expense Summary'!B38)","v":"[OTHER]"},{"$f":"IF('Expense Summary'!C38=0,\"\", 'Expense Summary'!C38)","v":""}]
[{"$f":"IF('Expense Summary'!B39=0,\"\", 'Expense Summary'!B39)","v":"[OTHER]"},{"$f":"IF('Expense Summary'!C39=0,\"\", 'Expense Summary'!C39)","v":""},{"$f":"F15 & \" Target\"","v":{"$error":"#REF!"}}]
["TOTAL HOUSING",{"$f":"SUM(B26:B39)","v":0},{"$f":"IFERROR((B40/'Income Summary'!$F$13),\"0.00%\")","v":"0.00%"}]
[]
["AUTO:"]
[{"$f":"IF('Expense Summary'!B43=0,\"\", 'Expense Summary'!B43)","v":"GASOLINE"},{"$f":"IF('Expense Summary'!C43=0,\"\", 'Expense Summary'!C43)","v":""}]
[{"$f":"IF('Expense Summary'!B44=0,\"\", 'Expense Summary'!B44)","v":"AUTO PAYMENTS/LEASE"},{"$f":"IF('Expense Summary'!C44=0,\"\", 'Expense Summary'!C44)","v":""}]
[{"$f":"IF('Expense Summary'!B45=0,\"\", 'Expense Summary'!B45)","v":"MAINTENANCE & REPAIRS"},{"$f":"IF('Expense Summary'!C45=0,\"\", 'Expense Summary'!C45)","v":""}]
[{"$f":"IF('Expense Summary'!B46=0,\"\", 'Expense Summary'!B46)","v":"PARKING/PUBLIC TRANSPORTATION"},{"$f":"IF('Expense Summary'!C46=0,\"\", 'Expense Summary'!C56)","v":""}]
[{"$f":"IF('Expense Summary'!B47=0,\"\", 'Expense Summary'!B47)","v":"REGISTRATION/TAXES"},{"$f":"IF('Expense Summary'!C47=0,\"\", 'Expense Summary'!C47)","v":""}]
[{"$f":"IF('Expense Summary'!B48=0,\"\", 'Expense Summary'!B48)","v":"[OTHER]"},{"$f":"IF('Expense Summary'!C48=0,\"\", 'Expense Summary'!C48)","v":""},{"$f":"F16 & \" Target\"","v":{"$error":"#REF!"}}]
["TOTAL TRANSPORTATION",{"$f":"SUM(B43:B48)","v":0},{"$f":"IFERROR((B49/'Income Summary'!$F$13),\"0.00%\")","v":"0.00%"}]
[]
["INSURANCE:"]
[{"$f":"IF('Expense Summary'!B52=0,\"\", 'Expense Summary'!B52)","v":"LIFE"},{"$f":"IF('Expense Summary'!C52=0,\"\", 'Expense Summary'!C52)","v":""}]
[{"$f":"IF('Expense Summary'!B53=0,\"\", 'Expense Summary'!B53)","v":"DISABILITY"},{"$f":"IF('Expense Summary'!C53=0,\"\", 'Expense Summary'!C53)","v":""}]
[{"$f":"IF('Expense Summary'!B54=0,\"\", 'Expense Summary'!B54)","v":"HEALTH PREMIUM"},{"$f":"IF('Expense Summary'!C54=0,\"\", 'Expense Summary'!C54)","v":""}]
[{"$f":"IF('Expense Summary'!B55=0,\"\", 'Expense Summary'!B55)","v":"AUTOMOBILE"},{"$f":"IF('Expense Summary'!C55=0,\"\", 'Expense Summary'!C55)","v":""}]
[{"$f":"IF('Expense Summary'!B56=0,\"\", 'Expense Summary'!B56)","v":"HOUSEHOLD"},{"$f":"IF('Expense Summary'!C56=0,\"\", 'Expense Summary'!C56)","v":""}]
[{"$f":"IF('Expense Summary'!B57=0,\"\", 'Expense Summary'!B57)","v":"EXCESS LIABILITY"},{"$f":"IF('Expense Summary'!C57=0,\"\", 'Expense Summary'!C57)","v":""}]
[{"$f":"IF('Expense Summary'!B58=0,\"\", 'Expense Summary'!B58)","v":"[OTHER]"},{"$f":"IF('Expense Summary'!C58=0,\"\", 'Expense Summary'!C58)","v":""}]
[{"$f":"IF('Expense Summary'!B59=0,\"\", 'Expense Summary'!B59)","v":"[OTHER]"},{"$f":"IF('Expense Summary'!C59=0,\"\", 'Expense Summary'!C59)","v":""},{"$f":"F17 & \" Target\"","v":{"$error":"#REF!"}}]
["TOTAL INSURANCE",{"$f":"SUM(B52:B59)","v":0},{"$f":"IFERROR((B60/'Income Summary'!$F$13),\"0.00%\")","v":"0.00%"}]
[]
["FOOD:"]
[{"$f":"IF('Expense Summary'!B63=0,\"\", 'Expense Summary'!B63)","v":"GROCERIES"},{"$f":"IF('Expense Summary'!C63=0,\"\", 'Expense Summary'!C63)","v":""}]
[{"$f":"IF('Expense Summary'!B64=0,\"\", 'Expense Summary'!B64)","v":"RESTAURANTS"},{"$f":"IF('Expense Summary'!C64=0,\"\", 'Expense Summary'!C64)","v":""}]
[{"$f":"IF('Expense Summary'!B65=0,\"\", 'Expense Summary'!B65)","v":"BARS/ALCOHOL"},{"$f":"IF('Expense Summary'!C65=0,\"\", 'Expense Summary'!C65)","v":""}]
[{"$f":"IF('Expense Summary'!B66=0,\"\", 'Expense Summary'!B66)","v":"COFFEE SHOPS"},{"$f":"IF('Expense Summary'!C66=0,\"\", 'Expense Summary'!C66)","v":""}]
[{"$f":"IF('Expense Summary'!B67=0,\"\", 'Expense Summary'!B67)","v":"[OTHER]"},{"$f":"IF('Expense Summary'!C67=0,\"\", 'Expense Summary'!C67)","v":""},{"$f":"F18 & \" Target\"","v":{"$error":"#REF!"}}]
["TOTAL FOOD",{"$f":"SUM(B63:B67)","v":0},{"$f":"IFERROR((B68/'Income Summary'!$F$13),\"0.00%\")","v":"0.00%"}]
[]
["MEDICAL EXPENSES:"]
[{"$f":"IF('Expense Summary'!B71=0,\"\", 'Expense Summary'!B71)","v":"PHYSICIANS"},{"$f":"IF('Expense Summary'!C71=0,\"\", 'Expense Summary'!C71)","v":""}]
[{"$f":"IF('Expense Summary'!B72=0,\"\", 'Expense Summary'!B72)","v":"DENTISTS"},{"$f":"IF('Expense Summary'!C72=0,\"\", 'Expense Summary'!C72)","v":""}]
[{"$f":"IF('Expense Summary'!B73=0,\"\", 'Expense Summary'!B73)","v":"PHARMACEUTICALS"},{"$f":"IF('Expense Summary'!C73=0,\"\", 'Expense Summary'!C73)","v":""}]
[{"$f":"IF('Expense Summary'!B74=0,\"\", 'Expense Summary'!B74)","v":"VISION"},{"$f":"IF('Expense Summary'!C74=0,\"\", 'Expense Summary'!C74)","v":""}]
[{"$f":"IF('Expense Summary'!B75=0,\"\", 'Expense Summary'!B75)","v":"[OTHER]"},{"$f":"IF('Expense Summary'!C75=0,\"\", 'Expense Summary'!C75)","v":""}]
[{"$f":"IF('Expense Summary'!B76=0,\"\", 'Expense Summary'!B76)","v":"[OTHER]"},{"$f":"IF('Expense Summary'!C76=0,\"\", 'Expense Summary'!C76)","v":""},{"$f":"F19 & \" Target\"","v":{"$error":"#REF!"}}]
["TOTAL MEDICAL EXPENSES",{"$f":"SUM(B71:B76)","v":0},{"$f":"IFERROR((B77/'Income Summary'!$F$13),\"0.00%\")","v":"0.00%"}]
[]
["CHILDREN'S EXPENSES:"]
[{"$f":"IF('Expense Summary'!B80=0,\"\", 'Expense Summary'!B80)","v":"TUITION"},{"$f":"IF('Expense Summary'!C80=0,\"\", 'Expense Summary'!C80)","v":""}]
[{"$f":"IF('Expense Summary'!B81=0,\"\", 'Expense Summary'!B81)","v":"SCHOOL LUNCHES"},{"$f":"IF('Expense Summary'!C81=0,\"\", 'Expense Summary'!C81)","v":""}]
[{"$f":"IF('Expense Summary'!B82=0,\"\", 'Expense Summary'!B82)","v":"DAY CARE"},{"$f":"IF('Expense Summary'!C82=0,\"\", 'Expense Summary'!C82)","v":""}]
[{"$f":"IF('Expense Summary'!B83=0,\"\", 'Expense Summary'!B83)","v":"ALLOWANCES"},{"$f":"IF('Expense Summary'!C83=0,\"\", 'Expense Summary'!C83)","v":""}]
[{"$f":"IF('Expense Summary'!B84=0,\"\", 'Expense Summary'!B84)","v":"LESSONS"},{"$f":"IF('Expense Summary'!C84=0,\"\", 'Expense Summary'!C84)","v":""}]
[{"$f":"IF('Expense Summary'!B85=0,\"\", 'Expense Summary'!B85)","v":"[OTHER]"},{"$f":"IF('Expense Summary'!C85=0,\"\", 'Expense Summary'!C85)","v":""}]
[{"$f":"IF('Expense Summary'!B86=0,\"\", 'Expense Summary'!B86)","v":"[OTHER]"},{"$f":"IF('Expense Summary'!C86=0,\"\", 'Expense Summary'!C86)","v":""},{"$f":"F20 & \" Target\"","v":{"$error":"#REF!"}}]
["TOTAL CHILDREN'S EXPENSES",{"$f":"SUM(B80:B86)","v":0},{"$f":"IFERROR((B87/'Income Summary'!$F$13),\"0.00%\")","v":"0.00%"}]
[]
["CLOTHING:"]
[{"$f":"IF('Expense Summary'!B90=0,\"\", 'Expense Summary'!B90)","v":"[CLOTHING OTHER]"},{"$f":"IF('Expense Summary'!C90=0,\"\", 'Expense Summary'!C90)","v":""}]
[{"$f":"IF('Expense Summary'!B91=0,\"\", 'Expense Summary'!B91)","v":"[CLOTHING OTHER]"},{"$f":"IF('Expense Summary'!C91=0,\"\", 'Expense Summary'!C91)","v":""},{"$f":"F21 & \" Target\"","v":{"$error":"#REF!"}}]
["TOTAL CLOTHING",{"$f":"SUM(B90:B91)","v":0},{"$f":"IFERROR((B92/'Income Summary'!$F$13),\"0.00%\")","v":"0.00%"}]
[]
["ENTERTAINMENT:"]
[{"$f":"IF('Expense Summary'!B95=0,\"\", 'Expense Summary'!B95)","v":"EVENINGS OUT"},{"$f":"IF('Expense Summary'!C95=0,\"\", 'Expense Summary'!C95)","v":""}]
[{"$f":"IF('Expense Summary'!B96=0,\"\", 'Expense Summary'!B96)","v":"BABY SITTERS"},{"$f":"IF('Expense Summary'!C96=0,\"\", 'Expense Summary'!C96)","v":""}]
[{"$f":"IF('Expense Summary'!B97=0,\"\", 'Expense Summary'!B97)","v":"MEDIA SUBSCRIPTIONS"},{"$f":"IF('Expense Summary'!C97=0,\"\", 'Expense Summary'!C97)","v":""}]
[{"$f":"IF('Expense Summary'!B98=0,\"\", 'Expense Summary'!B98)","v":"PAPER SUBSCRIPTIONS"},{"$f":"IF('Expense Summary'!C98=0,\"\", 'Expense Summary'!C98)","v":""}]
[{"$f":"IF('Expense Summary'!B99=0,\"\", 'Expense Summary'!B99)","v":"DUES/CLUBS/ACTIVITIES"},{"$f":"IF('Expense Summary'!C99=0,\"\", 'Expense Summary'!C699)","v":""}]
[{"$f":"IF('Expense Summary'!B100=0,\"\", 'Expense Summary'!B100)","v":"VACATIONS"},{"$f":"IF('Expense Summary'!C100=0,\"\", 'Expense Summary'!C100)","v":""}]
[{"$f":"IF('Expense Summary'!B101=0,\"\", 'Expense Summary'!B101)","v":"[OTHER]"},{"$f":"IF('Expense Summary'!C101=0,\"\", 'Expense Summary'!C101)","v":""}]
[{"$f":"IF('Expense Summary'!B102=0,\"\", 'Expense Summary'!B102)","v":"[OTHER]"},{"$f":"IF('Expense Summary'!C102=0,\"\", 'Expense Summary'!C102)","v":""},{"$f":"F22 & \" Target\"","v":{"$error":"#REF!"}}]
["TOTAL ENTERTAINMENT",{"$f":"SUM(B95:B102)","v":0},{"$f":"IFERROR((B103/'Income Summary'!$F$13),\"0.00%\")","v":"0.00%"}]
[]
["MISCELLANEOUS:"]
[{"$f":"IF('Expense Summary'!B106=0,\"\", 'Expense Summary'!B106)","v":"TOILETRIES"},{"$f":"IF('Expense Summary'!C106=0,\"\", 'Expense Summary'!C107)","v":""}]
[{"$f":"IF('Expense Summary'!B107=0,\"\", 'Expense Summary'!B107)","v":"DRY CLEANING"},{"$f":"IF('Expense Summary'!C107=0,\"\", 'Expense Summary'!C107)","v":""}]
[{"$f":"IF('Expense Summary'!B108=0,\"\", 'Expense Summary'!B108)","v":"PROFESSIONAL FEES"},{"$f":"IF('Expense Summary'!C108=0,\"\", 'Expense Summary'!C108)","v":""}]
[{"$f":"IF('Expense Summary'!B109=0,\"\", 'Expense Summary'!B109)","v":"ANIMALS"},{"$f":"IF('Expense Summary'!C109=0,\"\", 'Expense Summary'!C109)","v":""}]
[{"$f":"IF('Expense Summary'!B110=0,\"\", 'Expense Summary'!B110)","v":"BEAUTY & BARBER"},{"$f":"IF('Expense Summary'!C110=0,\"\", 'Expense Summary'!C110)","v":""}]
[{"$f":"IF('Expense Summary'!B111=0,\"\", 'Expense Summary'!B111)","v":"CASH ALLOWANCES"},{"$f":"IF('Expense Summary'!C111=0,\"\", 'Expense Summary'!C111)","v":""}]
[{"$f":"IF('Expense Summary'!B112=0,\"\", 'Expense Summary'!B112)","v":"OTHER SERVICES"},{"$f":"IF('Expense Summary'!C112=0,\"\", 'Expense Summary'!C112)","v":""}]
[{"$f":"IF('Expense Summary'!B113=0,\"\", 'Expense Summary'!B113)","v":"OTHER PURCHASES"},{"$f":"IF('Expense Summary'!C113=0,\"\", 'Expense Summary'!C113)","v":""}]
[{"$f":"IF('Expense Summary'!B114=0,\"\", 'Expense Summary'!B114)","v":"[OTHER]"},{"$f":"IF('Expense Summary'!C114=0,\"\", 'Expense Summary'!C114)","v":""}]
[{"$f":"IF('Expense Summary'!B115=0,\"\", 'Expense Summary'!B115)","v":"[OTHER]"},{"$f":"IF('Expense Summary'!C115=0,\"\", 'Expense Summary'!C115)","v":""},{"$f":"F23 & \" Target\"","v":{"$error":"#REF!"}}]
["TOTAL MISCELLANEOUS",{"$f":"SUM(B106:B115)","v":0},{"$f":"IFERROR((B116/'Income Summary'!$F$13),\"0.00%\")","v":"0.00%"}]
[]
[]
["SURPLUS / DEFICIT:"]
[null,"Current Spending","Percentage"]
["TOTAL GROSS INCOME",{"$f":"'Income Summary'!$F$13","v":0},1]
["TAXES & WITHHOLDING",{"$f":"'Income Summary'!$F$30","v":0},{"$f":"'Income Summary'!H30","v":0}]
["NET INCOME",{"$f":"B121-B122","v":0},{"$f":"C121-C122","v":1}]
["TOTAL EXPENSES",{"$f":"SUM(B16,B23,B116,B9,B103,B87,B77,B92,B68,B60,B49,B40)","v":0},{"$f":"B124/'Income Summary'!F13","v":{"$error":"#DIV/0!"}}]
["TOTAL SURPLUS / DEFICIT",{"$f":"B123-B124","v":0},{"$f":"C121-(C122+C124)","v":{"$error":"#DIV/0!"}}]

{"sheet":"Lifestyle & Budgeting","index":21,"n_rows":29,"n_cols":2,"rows_kept":29,"cut":false,"hidden":false,"merged":[[13,0,14,6],[18,0,21,6],[6,0,9,6],[28,0,32,6],[0,0,0,6],[2,0,4,6],[11,1,11,6],[16,1,16,6],[23,0,26,16383]]}
["Lifestyle"]
[]
["Before you start making a new budget, it's important to look at what type of lifestyle God wants you to have.  This will inform your decisions about where to adjust your spending and bring your life into greater harmony with God's will."]
[]
[]
[]
["In the Bible it is clear that God wants us to live lives of material contentment.  We were made to trust God rather than money for our joy, security, and purpose.  And since those things come from trust in God, we can be content to live within the provision that He is providing for us right now."]
[]
[]
[]
[]
[null,"Philippians 4:10-13; Matthew 6:25-34; 1 Timothy 6:6-8"]
[]
["It is also clear that God wants us to mimic Christ and live lives that are sacrificial: using the resources that we've been given to accurately represent God to others."]
[]
[]
[null,"1 Thessalonians 4:12; Philippians 2:5-8; 1 Timothy 6:18-19"]
[]
["In the following screens, you will decide on a new budget.  Enter your new budget numbers in the blue column.  For reference, your current spending amounts are included just to the left.  Also note that we have taken the goals you made during the homework section and placed them into your budget."]
[]
[]
[]
[]
["You can check the number at the bottom of the screen and if it is Red then you know you've budgeted more money than you have to spend.  You should consider cutting from the categories towards the bottom of the screen, as these are more discretionary than the ones at the top."]
[]
[]
[]
[]
["Once your \"Surplus/Deficit\" number is Green or Yellow, then you'll have succeeded in making a new budget that is balanced.  For married couples, you will each propose your own budget and then come together to agree on a budget between the two of you."]

{"sheet":"Person 1 Budget","index":22,"n_rows":125,"n_cols":8,"rows_kept":125,"cut":false,"hidden":false,"merged":[[0,0,0,3],[6,6,6,7]]}
["PERSONAL BUDGET "]
[null,"Current Spending","s Budget","% of Gross"]
["GIFTS:"]
[{"$f":"'Current Spending Analysis'!A4","v":"GIVING PLEDGE"},{"$f":"IF('Current Spending Analysis'!B4=0,\"\", 'Current Spending Analysis'!B4)","v":""}]
[{"$f":"'Current Spending Analysis'!A5","v":"CHARITIES"},{"$f":"IF('Current Spending Analysis'!B5=0,\"\", 'Current Spending Analysis'!B5)","v":""}]
[{"$f":"'Current Spending Analysis'!A6","v":"MISSIONARIES"},{"$f":"IF('Current Spending Analysis'!B6=0,\"\", 'Current Spending Analysis'!B6)","v":""}]
[{"$f":"'Current Spending Analysis'!A7","v":"CHRISTMAS/BIRTHDAYS"},{"$f":"IF('Current Spending Analysis'!B7=0,\"\", 'Current Spending Analysis'!B7)","v":""},null,null,null,null,"Spending Guide"]
[{"$f":"'Current Spending Analysis'!A8","v":"[OTHER]"},{"$f":"IF('Current Spending Analysis'!B8=0,\"\", 'Current Spending Analysis'!B8)","v":""},null,{"$f":"G11 & \" Target\"","v":{"$error":"#REF!"}},null,{"$f":"'Spending Guides'!$A$4","v":"Income Level"},{"$f":"IF('Income Summary'!$G$13<20000,(HLOOKUP(20001,INDIRECT('Spending Guides'!$A$1),1,TRUE)),(HLOOKUP('Income Summary'!$G$13,INDIRECT('Spending Guides'!$A$1),1,TRUE)))","v":{"$error":"#REF!"}},{"$f":"IF('Income Summary'!$G$13<100000,HLOOKUP(('Income Summary'!$G$13+10000),INDIRECT('Spending Guides'!$A$1),1,TRUE),HLOOKUP('Income Summary'!$G$13+20000,INDIRECT('Spending Guides'!$A$1),1,TRUE))","v":{"$error":"#REF!"}}]
["TOTAL GIFTS",{"$f":"SUM(B4:B8)","v":0},{"$f":"SUM(C4:C8)","v":0},{"$f":"IFERROR((C9/'Income Summary'!$F$13),\"0.00%\")","v":"0.00%"}]
[null,null,null,null,null,{"$f":"'Spending Guides'!$A$6","v":" Taxes"},{"$f":"IF('Income Summary'!$G$13<20000,(HLOOKUP(20001,INDIRECT('Spending Guides'!$A$1),3,TRUE)),(HLOOKUP('Income Summary'!$G$13,INDIRECT('Spending Guides'!$A$1),3,TRUE)))","v":{"$error":"#REF!"}},{"$f":"IF('Income Summary'!$G$13<100000,HLOOKUP(('Income Summary'!$G$13+10000),INDIRECT('Spending Guides'!$A$1),3,TRUE),HLOOKUP('Income Summary'!$G$13+20000,INDIRECT('Spending Guides'!$A$1),3,TRUE))","v":{"$error":"#REF!"}}]
["SAVINGS:",null,null,null,null,{"$f":"'Spending Guides'!$A$7","v":" Giving"},{"$f":"IF('Income Summary'!$G$13<20000,(HLOOKUP(20001,INDIRECT('Spending Guides'!$A$1),4,TRUE)),(HLOOKUP('Income Summary'!$G$13,INDIRECT('Spending Guides'!$A$1),4,TRUE)))","v":{"$error":"#REF!"}},{"$f":"IF('Income Summary'!$G$13<100000,HLOOKUP(('Income Summary'!$G$13+10000),INDIRECT('Spending Guides'!$A$1),4,TRUE),HLOOKUP('Income Summary'!$G$13+20000,INDIRECT('Spending Guides'!$A$1),4,TRUE))","v":{"$error":"#REF!"}}]
[{"$f":"'Current Spending Analysis'!A12","v":"GENERAL"},{"$f":"IF('Current Spending Analysis'!B12=0,\"\", 'Current Spending Analysis'!B12)","v":""},null,null,null,{"$f":"'Spending Guides'!$A$8","v":" Savings"},{"$f":"IF('Income Summary'!$G$13<20000,(HLOOKUP(20001,INDIRECT('Spending Guides'!$A$1),5,TRUE)),(HLOOKUP('Income Summary'!$G$13,INDIRECT('Spending Guides'!$A$1),5,TRUE)))","v":{"$error":"#REF!"}},{"$f":"IF('Income Summary'!$G$13<100000,HLOOKUP(('Income Summary'!$G$13+10000),INDIRECT('Spending Guides'!$A$1),5,TRUE),HLOOKUP('Income Summary'!$G$13+20000,INDIRECT('Spending Guides'!$A$1),5,TRUE))","v":{"$error":"#REF!"}}]
[{"$f":"'Current Spending Analysis'!A13","v":"EDUCATION"},{"$f":"IF('Current Spending Analysis'!B13=0,\"\", 'Current Spending Analysis'!B13)","v":""},null,null,null,{"$f":"'Spending Guides'!$A$9","v":" Debt (non mortgage)"},{"$f":"IF('Income Summary'!$G$13<20000,(HLOOKUP(20001,INDIRECT('Spending Guides'!$A$1),6,TRUE)),(HLOOKUP('Income Summary'!$G$13,INDIRECT('Spending Guides'!$A$1),6,TRUE)))","v":{"$error":"#REF!"}},{"$f":"IF('Income Summary'!$G$13<100000,HLOOKUP(('Income Summary'!$G$13+10000),INDIRECT('Spending Guides'!$A$1),6,TRUE),HLOOKUP('Income Summary'!$G$13+20000,INDIRECT('Spending Guides'!$A$1),6,TRUE))","v":{"$error":"#REF!"}}]
[{"$f":"'Current Spending Analysis'!A14","v":"RETIREMENT"},{"$f":"IF('Current Spending Analysis'!B14=0,\"\", 'Current Spending Analysis'!B14)","v":""}]
[{"$f":"'Current Spending Analysis'!A15","v":"[OTHER]"},{"$f":"IF('Current Spending Analysis'!B15=0,\"\", 'Current Spending Analysis'!B15)","v":""},null,{"$f":"G12 & \" Target\"","v":{"$error":"#REF!"}},null,{"$f":"'Spending Guides'!$A$11","v":" Housing"},{"$f":"IF('Income Summary'!$G$13<20000,(HLOOKUP(20001,INDIRECT('Spending Guides'!$A$1),8,TRUE)),(HLOOKUP('Income Summary'!$G$13,INDIRECT('Spending Guides'!$A$1),8,TRUE)))","v":{"$error":"#REF!"}},{"$f":"IF('Income Summary'!$G$13<100000,HLOOKUP(('Income Summary'!$G$13+10000),INDIRECT('Spending Guides'!$A$1),8,TRUE),HLOOKUP('Income Summary'!$G$13+20000,INDIRECT('Spending Guides'!$A$1),8,TRUE))","v":{"$error":"#REF!"}}]
["TOTAL SAVINGS",{"$f":"SUM(B12:B15)","v":0},{"$f":"SUM(C12:C15)","v":0},{"$f":"IFERROR((C16/'Income Summary'!$F$13),\"0.00%\")","v":"0.00%"},null,{"$f":"'Spending Guides'!$A$12","v":" Auto"},{"$f":"IF('Income Summary'!$G$13<20000,(HLOOKUP(20001,INDIRECT('Spending Guides'!$A$1),9,TRUE)),(HLOOKUP('Income Summary'!$G$13,INDIRECT('Spending Guides'!$A$1),9,TRUE)))","v":{"$error":"#REF!"}},{"$f":"IF('Income Summary'!$G$13<100000,HLOOKUP(('Income Summary'!$G$13+10000),INDIRECT('Spending Guides'!$A$1),9,TRUE),HLOOKUP('Income Summary'!$G$13+20000,INDIRECT('Spending Guides'!$A$1),9,TRUE))","v":{"$error":"#REF!"}}]
[null,null,null,null,null,{"$f":"'Spending Guides'!$A$13","v":" Insurance"},{"$f":"IF('Income Summary'!$G$13<20000,(HLOOKUP(20001,INDIRECT('Spending Guides'!$A$1),10,TRUE)),(HLOOKUP('Income Summary'!$G$13,INDIRECT('Spending Guides'!$A$1),10,TRUE)))","v":{"$error":"#REF!"}},{"$f":"IF('Income Summary'!$G$13<100000,HLOOKUP(('Income Summary'!$G$13+10000),INDIRECT('Spending Guides'!$A$1),10,TRUE),HLOOKUP('Income Summary'!$G$13+20000,INDIRECT('Spending Guides'!$A$1),10,TRUE))","v":{"$error":"#REF!"}}]
["DEBT SERVICE:",null,null,null,null,{"$f":"'Spending Guides'!$A$14","v":" Food"},{"$f":"IF('Income Summary'!$G$13<20000,(HLOOKUP(20001,INDIRECT('Spending Guides'!$A$1),11,TRUE)),(HLOOKUP('Income Summary'!$G$13,INDIRECT('Spending Guides'!$A$1),11,TRUE)))","v":{"$error":"#REF!"}},{"$f":"IF('Income Summary'!$G$13<100000,HLOOKUP(('Income Summary'!$G$13+10000),INDIRECT('Spending Guides'!$A$1),11,TRUE),HLOOKUP('Income Summary'!$G$13+20000,INDIRECT('Spending Guides'!$A$1),11,TRUE))","v":{"$error":"#REF!"}}]
[{"$f":"'Current Spending Analysis'!A19","v":"EDUCATION LOANS"},{"$f":"IF('Current Spending Analysis'!B19=0,\"\", 'Current Spending Analysis'!B19)","v":""},null,null,null,{"$f":"'Spending Guides'!$A$15","v":" Medical"},{"$f":"IF('Income Summary'!$G$13<20000,(HLOOKUP(20001,INDIRECT('Spending Guides'!$A$1),12,TRUE)),(HLOOKUP('Income Summary'!$G$13,INDIRECT('Spending Guides'!$A$1),12,TRUE)))","v":{"$error":"#REF!"}},{"$f":"IF('Income Summary'!$G$13<100000,HLOOKUP(('Income Summary'!$G$13+10000),INDIRECT('Spending Guides'!$A$1),12,TRUE),HLOOKUP('Income Summary'!$G$13+20000,INDIRECT('Spending Guides'!$A$1),12,TRUE))","v":{"$error":"#REF!"}}]
[{"$f":"'Current Spending Analysis'!A20","v":"CREDIT CARDS/PERSONAL NOTES"},{"$f":"IF('Current Spending Analysis'!B20=0,\"\", 'Current Spending Analysis'!B20)","v":""},null,null,null,{"$f":"'Spending Guides'!$A$16","v":" Children"},{"$f":"IF('Income Summary'!$G$13<20000,(HLOOKUP(20001,INDIRECT('Spending Guides'!$A$1),13,TRUE)),(HLOOKUP('Income Summary'!$G$13,INDIRECT('Spending Guides'!$A$1),13,TRUE)))","v":{"$error":"#REF!"}},{"$f":"IF('Income Summary'!$G$13<100000,HLOOKUP(('Income Summary'!$G$13+10000),INDIRECT('Spending Guides'!$A$1),13,TRUE),HLOOKUP('Income Summary'!$G$13+20000,INDIRECT('Spending Guides'!$A$1),13,TRUE))","v":{"$error":"#REF!"}}]
[{"$f":"'Current Spending Analysis'!A21","v":"[OTHER]"},{"$f":"IF('Current Spending Analysis'!B21=0,\"\", 'Current Spending Analysis'!B21)","v":""},null,null,null,{"$f":"'Spending Guides'!$A$17","v":" Clothing"},{"$f":"IF('Income Summary'!$G$13<20000,(HLOOKUP(20001,INDIRECT('Spending Guides'!$A$1),14,TRUE)),(HLOOKUP('Income Summary'!$G$13,INDIRECT('Spending Guides'!$A$1),14,TRUE)))","v":{"$error":"#REF!"}},{"$f":"IF('Income Summary'!$G$13<100000,HLOOKUP(('Income Summary'!$G$13+10000),INDIRECT('Spending Guides'!$A$1),14,TRUE),HLOOKUP('Income Summary'!$G$13+20000,INDIRECT('Spending Guides'!$A$1),14,TRUE))","v":{"$error":"#REF!"}}]
[{"$f":"'Current Spending Analysis'!A22","v":"[OTHER]"},{"$f":"IF('Current Spending Analysis'!B22=0,\"\", 'Current Spending Analysis'!B22)","v":""},null,{"$f":"G13 & \" Target\"","v":{"$error":"#REF!"}},null,{"$f":"'Spending Guides'!$A$18","v":"Entertainment"},{"$f":"IF('Income Summary'!$G$13<20000,(HLOOKUP(20001,INDIRECT('Spending Guides'!$A$1),15,TRUE)),(HLOOKUP('Income Summary'!$G$13,INDIRECT('Spending Guides'!$A$1),15,TRUE)))","v":{"$error":"#REF!"}},{"$f":"IF('Income Summary'!$G$13<100000,HLOOKUP(('Income Summary'!$G$13+10000),INDIRECT('Spending Guides'!$A$1),15,TRUE),HLOOKUP('Income Summary'!$G$13+20000,INDIRECT('Spending Guides'!$A$1),15,TRUE))","v":{"$error":"#REF!"}}]
["TOTAL DEBT",{"$f":"SUM(B19:B22)","v":0},{"$f":"SUM(C19:C22)","v":0},{"$f":"IFERROR((C23/'Income Summary'!$F$13),\"0.00%\")","v":"0.00%"},null,{"$f":"'Spending Guides'!$A$19","v":" Misc."},{"$f":"IF('Income Summary'!$G$13<20000,(HLOOKUP(20001,INDIRECT('Spending Guides'!$A$1),16,TRUE)),(HLOOKUP('Income Summary'!$G$13,INDIRECT('Spending Guides'!$A$1),16,TRUE)))","v":{"$error":"#REF!"}},{"$f":"IF('Income Summary'!$G$13<100000,HLOOKUP(('Income Summary'!$G$13+10000),INDIRECT('Spending Guides'!$A$1),16,TRUE),HLOOKUP('Income Summary'!$G$13+20000,INDIRECT('Spending Guides'!$A$1),16,TRUE))","v":{"$error":"#REF!"}}]
[]
["HOUSING:"]
[{"$f":"'Current Spending Analysis'!A26","v":"MORTGAGE/RENT"},{"$f":"IF('Current Spending Analysis'!B26=0,\"\", 'Current Spending Analysis'!B26)","v":""}]
[{"$f":"'Current Spending Analysis'!A27","v":"PROERTY TAXES"},{"$f":"IF('Current Spending Analysis'!B27=0,\"\", 'Current Spending Analysis'!B27)","v":""}]
[{"$f":"'Current Spending Analysis'!A28","v":"ELECTRICITY"},{"$f":"IF('Current Spending Analysis'!B28=0,\"\", 'Current Spending Analysis'!B28)","v":""}]
[{"$f":"'Current Spending Analysis'!A29","v":"NATURAL GAS"},{"$f":"IF('Current Spending Analysis'!B29=0,\"\", 'Current Spending Analysis'!B29)","v":""}]
[{"$f":"'Current Spending Analysis'!A30","v":"WATER"},{"$f":"IF('Current Spending Analysis'!B30=0,\"\", 'Current Spending Analysis'!B30)","v":""}]
[{"$f":"'Current Spending Analysis'!A31","v":"CONDO FEE/HOA"},{"$f":"IF('Current Spending Analysis'!B31=0,\"\", 'Current Spending Analysis'!B31)","v":""}]
[{"$f":"'Current Spending Analysis'!A32","v":"CELLPHONES"},{"$f":"IF('Current Spending Analysis'!B32=0,\"\", 'Current Spending Analysis'!B32)","v":""}]
[{"$f":"'Current Spending Analysis'!A33","v":"INTERNET/CABLE"},{"$f":"IF('Current Spending Analysis'!B33=0,\"\", 'Current Spending Analysis'!B33)","v":""}]
[{"$f":"'Current Spending Analysis'!A34","v":"CLEANING SERVICES"},{"$f":"IF('Current Spending Analysis'!B34=0,\"\", 'Current Spending Analysis'!B34)","v":""}]
[{"$f":"'Current Spending Analysis'!A35","v":"SEWER/TRASH"},{"$f":"IF('Current Spending Analysis'!B35=0,\"\", 'Current Spending Analysis'!B35)","v":""}]
[{"$f":"'Current Spending Analysis'!A36","v":"REPAIRS/IMPROVEMENT"},{"$f":"IF('Current Spending Analysis'!B36=0,\"\", 'Current Spending Analysis'!B36)","v":""}]
[{"$f":"'Current Spending Analysis'!A37","v":"FURNISHINGS"},{"$f":"IF('Current Spending Analysis'!B37=0,\"\", 'Current Spending Analysis'!B37)","v":""}]
[{"$f":"'Current Spending Analysis'!A38","v":"[OTHER]"},{"$f":"IF('Current Spending Analysis'!B38=0,\"\", 'Current Spending Analysis'!B38)","v":""}]
[{"$f":"'Current Spending Analysis'!A39","v":"[OTHER]"},{"$f":"IF('Current Spending Analysis'!B39=0,\"\", 'Current Spending Analysis'!B39)","v":""},null,{"$f":"G15 & \" Target\"","v":{"$error":"#REF!"}}]
["TOTAL HOUSING",{"$f":"SUM(B26:B39)","v":0},{"$f":"SUM(C26:C39)","v":0},{"$f":"IFERROR((C40/'Income Summary'!$F$13),\"0.00%\")","v":"0.00%"}]
[]
["TRANSPORTATION:"]
[{"$f":"'Current Spending Analysis'!A43","v":"GASOLINE"},{"$f":"IF('Current Spending Analysis'!B43=0,\"\", 'Current Spending Analysis'!B43)","v":""}]
[{"$f":"'Current Spending Analysis'!A44","v":"AUTO PAYMENTS/LEASE"},{"$f":"IF('Current Spending Analysis'!B44=0,\"\", 'Current Spending Analysis'!B44)","v":""}]
[{"$f":"'Current Spending Analysis'!A45","v":"MAINTENANCE & REPAIRS"},{"$f":"IF('Current Spending Analysis'!B45=0,\"\", 'Current Spending Analysis'!B45)","v":""}]
[{"$f":"'Current Spending Analysis'!A46","v":"PARKING/PUBLIC TRANSPORTATION"},{"$f":"IF('Current Spending Analysis'!B46=0,\"\", 'Current Spending Analysis'!B46)","v":""}]
[{"$f":"'Current Spending Analysis'!A47","v":"REGISTRATION/TAXES"},{"$f":"IF('Current Spending Analysis'!B47=0,\"\", 'Current Spending Analysis'!B47)","v":""}]
[{"$f":"'Current Spending Analysis'!A48","v":"[OTHER]"},{"$f":"IF('Current Spending Analysis'!B48=0,\"\", 'Current Spending Analysis'!B48)","v":""},null,{"$f":"G16 & \" Target\"","v":{"$error":"#REF!"}}]
["TOTAL TRANSPORTATION",{"$f":"SUM(B43:B48)","v":0},{"$f":"SUM(C43:C48)","v":0},{"$f":"IFERROR((C49/'Income Summary'!$F$13),\"0.00%\")","v":"0.00%"}]
[]
["INSURANCE:"]
[{"$f":"'Current Spending Analysis'!A52","v":"LIFE"},{"$f":"IF('Current Spending Analysis'!B52=0,\"\", 'Current Spending Analysis'!B52)","v":""}]
[{"$f":"'Current Spending Analysis'!A53","v":"DISABILITY"},{"$f":"IF('Current Spending Analysis'!B53=0,\"\", 'Current Spending Analysis'!B53)","v":""}]
[{"$f":"'Current Spending Analysis'!A54","v":"HEALTH PREMIUM"},{"$f":"IF('Current Spending Analysis'!B54=0,\"\", 'Current Spending Analysis'!B54)","v":""}]
[{"$f":"'Current Spending Analysis'!A55","v":"AUTOMOBILE"},{"$f":"IF('Current Spending Analysis'!B55=0,\"\", 'Current Spending Analysis'!B55)","v":""}]
[{"$f":"'Current Spending Analysis'!A56","v":"HOUSEHOLD"},{"$f":"IF('Current Spending Analysis'!B56=0,\"\", 'Current Spending Analysis'!B56)","v":""}]
[{"$f":"'Current Spending Analysis'!A57","v":"EXCESS LIABILITY"},{"$f":"IF('Current Spending Analysis'!B57=0,\"\", 'Current Spending Analysis'!B57)","v":""}]
[{"$f":"'Current Spending Analysis'!A58","v":"[OTHER]"},{"$f":"IF('Current Spending Analysis'!B58=0,\"\", 'Current Spending Analysis'!B58)","v":""}]
[{"$f":"'Current Spending Analysis'!A59","v":"[OTHER]"},{"$f":"IF('Current Spending Analysis'!B59=0,\"\", 'Current Spending Analysis'!B59)","v":""},null,{"$f":"G17& \" Target\"","v":{"$error":"#REF!"}}]
["TOTAL INSURANCE",{"$f":"SUM(B52:B59)","v":0},{"$f":"SUM(C52:C59)","v":0},{"$f":"IFERROR((C60/'Income Summary'!$F$13),\"0.00%\")","v":"0.00%"}]
[]
["FOOD:"]
[{"$f":"'Current Spending Analysis'!A63","v":"GROCERIES"},{"$f":"IF('Current Spending Analysis'!B63=0,\"\", 'Current Spending Analysis'!B63)","v":""}]
[{"$f":"'Current Spending Analysis'!A64","v":"RESTAURANTS"},{"$f":"IF('Current Spending Analysis'!B64=0,\"\", 'Current Spending Analysis'!B64)","v":""}]
[{"$f":"'Current Spending Analysis'!A65","v":"BARS/ALCOHOL"},{"$f":"IF('Current Spending Analysis'!B65=0,\"\", 'Current Spending Analysis'!B65)","v":""}]
[{"$f":"'Current Spending Analysis'!A66","v":"COFFEE SHOPS"},{"$f":"IF('Current Spending Analysis'!B66=0,\"\", 'Current Spending Analysis'!B66)","v":""}]
[{"$f":"'Current Spending Analysis'!A67","v":"[OTHER]"},{"$f":"IF('Current Spending Analysis'!B67=0,\"\", 'Current Spending Analysis'!B67)","v":""},null,{"$f":"G18 & \" Target\"","v":{"$error":"#REF!"}}]
["TOTAL FOOD",{"$f":"SUM(B63:B67)","v":0},{"$f":"SUM(C63:C67)","v":0},{"$f":"IFERROR((C68/'Income Summary'!$F$13),\"0.00%\")","v":"0.00%"}]
[]
["MEDICAL EXPENSES:"]
[{"$f":"'Current Spending Analysis'!A71","v":"PHYSICIANS"},{"$f":"IF('Current Spending Analysis'!B71=0,\"\", 'Current Spending Analysis'!B71)","v":""}]
[{"$f":"'Current Spending Analysis'!A72","v":"DENTISTS"},{"$f":"IF('Current Spending Analysis'!B72=0,\"\", 'Current Spending Analysis'!B72)","v":""}]
[{"$f":"'Current Spending Analysis'!A73","v":"PHARMACEUTICALS"},{"$f":"IF('Current Spending Analysis'!B73=0,\"\", 'Current Spending Analysis'!B73)","v":""}]
[{"$f":"'Current Spending Analysis'!A74","v":"VISION"},{"$f":"IF('Current Spending Analysis'!B74=0,\"\", 'Current Spending Analysis'!B74)","v":""}]
[{"$f":"'Current Spending Analysis'!A75","v":"[OTHER]"},{"$f":"IF('Current Spending Analysis'!B75=0,\"\", 'Current Spending Analysis'!B75)","v":""}]
[{"$f":"'Current Spending Analysis'!A76","v":"[OTHER]"},{"$f":"IF('Current Spending Analysis'!B76=0,\"\", 'Current Spending Analysis'!B76)","v":""},null,{"$f":"G19 & \" Target\"","v":{"$error":"#REF!"}}]
["TOTAL MEDICAL EXPENSES",{"$f":"SUM(B71:B76)","v":0},{"$f":"SUM(C71:C76)","v":0},{"$f":"IFERROR((C77/'Income Summary'!$F$13),\"0.00%\")","v":"0.00%"}]
[]
["CHILDREN'S EXPENSES:"]
[{"$f":"'Current Spending Analysis'!A80","v":"TUITION"},{"$f":"IF('Current Spending Analysis'!B80=0,\"\", 'Current Spending Analysis'!B80)","v":""}]
[{"$f":"'Current Spending Analysis'!A81","v":"SCHOOL LUNCHES"},{"$f":"IF('Current Spending Analysis'!B81=0,\"\", 'Current Spending Analysis'!B81)","v":""}]
[{"$f":"'Current Spending Analysis'!A82","v":"DAY CARE"},{"$f":"IF('Current Spending Analysis'!B82=0,\"\", 'Current Spending Analysis'!B82)","v":""}]
[{"$f":"'Current Spending Analysis'!A83","v":"ALLOWANCES"},{"$f":"IF('Current Spending Analysis'!B83=0,\"\", 'Current Spending Analysis'!B83)","v":""}]
[{"$f":"'Current Spending Analysis'!A84","v":"LESSONS"},{"$f":"IF('Current Spending Analysis'!B84=0,\"\", 'Current Spending Analysis'!B84)","v":""}]
[{"$f":"'Current Spending Analysis'!A85","v":"[OTHER]"},{"$f":"IF('Current Spending Analysis'!B85=0,\"\", 'Current Spending Analysis'!B85)","v":""}]
[{"$f":"'Current Spending Analysis'!A86","v":"[OTHER]"},{"$f":"IF('Current Spending Analysis'!B86=0,\"\", 'Current Spending Analysis'!B86)","v":""},null,{"$f":"G20 & \" Target\"","v":{"$error":"#REF!"}}]
["TOTAL CHILDREN'S EXPENSES",{"$f":"SUM(B80:B86)","v":0},{"$f":"SUM(C80:C86)","v":0},{"$f":"IFERROR((C87/'Income Summary'!$F$13),\"0.00%\")","v":"0.00%"}]
[]
["CLOTHING:"]
[{"$f":"'Current Spending Analysis'!A90","v":"[CLOTHING OTHER]"},{"$f":"IF('Current Spending Analysis'!B90=0,\"\", 'Current Spending Analysis'!B90)","v":""}]
[{"$f":"'Current Spending Analysis'!A91","v":"[CLOTHING OTHER]"},{"$f":"IF('Current Spending Analysis'!B91=0,\"\", 'Current Spending Analysis'!B91)","v":""},null,{"$f":"G21 & \" Target\"","v":{"$error":"#REF!"}}]
["TOTAL CLOTHING",{"$f":"SUM(B90:B91)","v":0},{"$f":"SUM(C90:C91)","v":0},{"$f":"IFERROR((C92/'Income Summary'!$F$13),\"0.00%\")","v":"0.00%"}]
[]
["ENTERTAINMENT:"]
[{"$f":"'Current Spending Analysis'!A95","v":"EVENINGS OUT"},{"$f":"IF('Current Spending Analysis'!B95=0,\"\", 'Current Spending Analysis'!B95)","v":""}]
[{"$f":"'Current Spending Analysis'!A96","v":"BABY SITTERS"},{"$f":"IF('Current Spending Analysis'!B96=0,\"\", 'Current Spending Analysis'!B96)","v":""}]
[{"$f":"'Current Spending Analysis'!A97","v":"MEDIA SUBSCRIPTIONS"},{"$f":"IF('Current Spending Analysis'!B97=0,\"\", 'Current Spending Analysis'!B97)","v":""}]
[{"$f":"'Current Spending Analysis'!A98","v":"PAPER SUBSCRIPTIONS"},{"$f":"IF('Current Spending Analysis'!B98=0,\"\", 'Current Spending Analysis'!B98)","v":""}]
[{"$f":"'Current Spending Analysis'!A99","v":"DUES/CLUBS/ACTIVITIES"},{"$f":"IF('Current Spending Analysis'!B99=0,\"\", 'Current Spending Analysis'!B99)","v":""}]
[{"$f":"'Current Spending Analysis'!A100","v":"VACATIONS"},{"$f":"IF('Current Spending Analysis'!B100=0,\"\", 'Current Spending Analysis'!B100)","v":""}]
[{"$f":"'Current Spending Analysis'!A101","v":"[OTHER]"},{"$f":"IF('Current Spending Analysis'!B101=0,\"\", 'Current Spending Analysis'!B101)","v":""}]
[{"$f":"'Current Spending Analysis'!A102","v":"[OTHER]"},{"$f":"IF('Current Spending Analysis'!B102=0,\"\", 'Current Spending Analysis'!B102)","v":""},null,{"$f":"G22 & \" Target\"","v":{"$error":"#REF!"}}]
["TOTAL ENTERTAINMENT",{"$f":"SUM(B95:B102)","v":0},{"$f":"SUM(C95:C102)","v":0},{"$f":"IFERROR((C103/'Income Summary'!$F$13),\"0.00%\")","v":"0.00%"}]
[]
["MISCELLANEOUS:"]
[{"$f":"'Current Spending Analysis'!A106","v":"TOILETRIES"},{"$f":"IF('Current Spending Analysis'!B106=0,\"\", 'Current Spending Analysis'!B106)","v":""}]
[{"$f":"'Current Spending Analysis'!A107","v":"DRY CLEANING"},{"$f":"IF('Current Spending Analysis'!B107=0,\"\", 'Current Spending Analysis'!B107)","v":""}]
[{"$f":"'Current Spending Analysis'!A108","v":"PROFESSIONAL FEES"},{"$f":"IF('Current Spending Analysis'!B108=0,\"\", 'Current Spending Analysis'!B108)","v":""}]
[{"$f":"'Current Spending Analysis'!A109","v":"ANIMALS"},{"$f":"IF('Current Spending Analysis'!B109=0,\"\", 'Current Spending Analysis'!B109)","v":""}]
[{"$f":"'Current Spending Analysis'!A110","v":"BEAUTY & BARBER"},{"$f":"IF('Current Spending Analysis'!B110=0,\"\", 'Current Spending Analysis'!B110)","v":""}]
[{"$f":"'Current Spending Analysis'!A111","v":"CASH ALLOWANCES"},{"$f":"IF('Current Spending Analysis'!B111=0,\"\", 'Current Spending Analysis'!B111)","v":""}]
[{"$f":"'Current Spending Analysis'!A112","v":"OTHER SERVICES"},{"$f":"IF('Current Spending Analysis'!B112=0,\"\", 'Current Spending Analysis'!B112)","v":""}]
[{"$f":"'Current Spending Analysis'!A113","v":"OTHER PURCHASES"},{"$f":"IF('Current Spending Analysis'!B113=0,\"\", 'Current Spending Analysis'!B113)","v":""}]
[{"$f":"'Current Spending Analysis'!A114","v":"[OTHER]"},{"$f":"IF('Current Spending Analysis'!B114=0,\"\", 'Current Spending Analysis'!B114)","v":""}]
[{"$f":"'Current Spending Analysis'!A115","v":"[OTHER]"},{"$f":"IF('Current Spending Analysis'!B115=0,\"\", 'Current Spending Analysis'!B115)","v":""},null,{"$f":"G23& \" Target\"","v":{"$error":"#REF!"}}]
["TOTAL MISCELLANEOUS",{"$f":"SUM(B106:B115)","v":0},{"$f":"SUM(C106:C115)","v":0},{"$f":"IFERROR((C116/'Income Summary'!$F$13),\"0.00%\")","v":"0.00%"}]
[]
[]
["SURPLUS / DEFICIT:"]
[null,"Current Spending","s Budget","Percentage"]
["TOTAL GROSS INCOME",{"$f":"'Income Summary'!$F$13","v":0},{"$f":"'Income Summary'!$F$13","v":0},1]
["TAXES & WITHHOLDING",{"$f":"'Income Summary'!$F$30","v":0},{"$f":"'Income Summary'!$F$30","v":0},{"$f":"'Income Summary'!$H$30","v":0}]
["NET INCOME",{"$f":"B121-B122","v":0},{"$f":"C121-C122","v":0},{"$f":"D121-D122","v":1}]
["TOTAL EXPENSES",{"$f":"SUM(B16,B23,B116,B9,B103,B87,B77,B92,B68,B60,B49,B40)","v":0},{"$f":"SUM(C16,C23,C116,C9,C103,C87,C77,C92,C68,C60,C49,C40)","v":0},{"$f":"C124/'Income Summary'!$F$13","v":{"$error":"#DIV/0!"}}]
["TOTAL SURPLUS / DEFICIT",{"$f":"B123-B124","v":0},{"$f":"C123-C124","v":0},{"$f":"D123-D124","v":{"$error":"#DIV/0!"}}]

{"sheet":"Person 2 Budget","index":23,"n_rows":125,"n_cols":8,"rows_kept":125,"cut":false,"hidden":false,"merged":[[0,0,0,3],[6,6,6,7]]}
["PERSONAL BUDGET "]
[null,"Current Spending"," ","% of Gross"]
["GIFTS:"]
[{"$f":"'Current Spending Analysis'!A4","v":"GIVING PLEDGE"},{"$f":"IF('Current Spending Analysis'!B4=0,\"\", 'Current Spending Analysis'!B4)","v":""}]
[{"$f":"'Current Spending Analysis'!A5","v":"CHARITIES"},{"$f":"IF('Current Spending Analysis'!B5=0,\"\", 'Current Spending Analysis'!B5)","v":""}]
[{"$f":"'Current Spending Analysis'!A6","v":"MISSIONARIES"},{"$f":"IF('Current Spending Analysis'!B6=0,\"\", 'Current Spending Analysis'!B6)","v":""}]
[{"$f":"'Current Spending Analysis'!A7","v":"CHRISTMAS/BIRTHDAYS"},{"$f":"IF('Current Spending Analysis'!B7=0,\"\", 'Current Spending Analysis'!B7)","v":""},null,null,null,null,"Spending Guide"]
[{"$f":"'Current Spending Analysis'!A8","v":"[OTHER]"},{"$f":"IF('Current Spending Analysis'!B8=0,\"\", 'Current Spending Analysis'!B8)","v":""},null,{"$f":"G11 & \" Target\"","v":{"$error":"#REF!"}},null,{"$f":"'Spending Guides'!$A$4","v":"Income Level"},{"$f":"IF('Income Summary'!$G$13<20000,(HLOOKUP(20001,INDIRECT('Spending Guides'!$A$1),1,TRUE)),(HLOOKUP('Income Summary'!$G$13,INDIRECT('Spending Guides'!$A$1),1,TRUE)))","v":{"$error":"#REF!"}},{"$f":"IF('Income Summary'!$G$13<100000,HLOOKUP(('Income Summary'!$G$13+10000),INDIRECT('Spending Guides'!$A$1),1,TRUE),HLOOKUP('Income Summary'!$G$13+20000,INDIRECT('Spending Guides'!$A$1),1,TRUE))","v":{"$error":"#REF!"}}]
["TOTAL GIFTS",{"$f":"SUM(B4:B8)","v":0},{"$f":"SUM(C4:C8)","v":0},{"$f":"IFERROR((C9/'Income Summary'!$F$13),\"0.00%\")","v":"0.00%"}]
[null,null,null,null,null,{"$f":"'Spending Guides'!$A$6","v":" Taxes"},{"$f":"IF('Income Summary'!$G$13<20000,(HLOOKUP(20001,INDIRECT('Spending Guides'!$A$1),3,TRUE)),(HLOOKUP('Income Summary'!$G$13,INDIRECT('Spending Guides'!$A$1),3,TRUE)))","v":{"$error":"#REF!"}},{"$f":"IF('Income Summary'!$G$13<100000,HLOOKUP(('Income Summary'!$G$13+10000),INDIRECT('Spending Guides'!$A$1),3,TRUE),HLOOKUP('Income Summary'!$G$13+20000,INDIRECT('Spending Guides'!$A$1),3,TRUE))","v":{"$error":"#REF!"}}]
["SAVINGS:",null,null,null,null,{"$f":"'Spending Guides'!$A$7","v":" Giving"},{"$f":"IF('Income Summary'!$G$13<20000,(HLOOKUP(20001,INDIRECT('Spending Guides'!$A$1),4,TRUE)),(HLOOKUP('Income Summary'!$G$13,INDIRECT('Spending Guides'!$A$1),4,TRUE)))","v":{"$error":"#REF!"}},{"$f":"IF('Income Summary'!$G$13<100000,HLOOKUP(('Income Summary'!$G$13+10000),INDIRECT('Spending Guides'!$A$1),4,TRUE),HLOOKUP('Income Summary'!$G$13+20000,INDIRECT('Spending Guides'!$A$1),4,TRUE))","v":{"$error":"#REF!"}}]
[{"$f":"'Current Spending Analysis'!A12","v":"GENERAL"},{"$f":"IF('Current Spending Analysis'!B12=0,\"\", 'Current Spending Analysis'!B12)","v":""},null,null,null,{"$f":"'Spending Guides'!$A$8","v":" Savings"},{"$f":"IF('Income Summary'!$G$13<20000,(HLOOKUP(20001,INDIRECT('Spending Guides'!$A$1),5,TRUE)),(HLOOKUP('Income Summary'!$G$13,INDIRECT('Spending Guides'!$A$1),5,TRUE)))","v":{"$error":"#REF!"}},{"$f":"IF('Income Summary'!$G$13<100000,HLOOKUP(('Income Summary'!$G$13+10000),INDIRECT('Spending Guides'!$A$1),5,TRUE),HLOOKUP('Income Summary'!$G$13+20000,INDIRECT('Spending Guides'!$A$1),5,TRUE))","v":{"$error":"#REF!"}}]
[{"$f":"'Current Spending Analysis'!A13","v":"EDUCATION"},{"$f":"IF('Current Spending Analysis'!B13=0,\"\", 'Current Spending Analysis'!B13)","v":""},null,null,null,{"$f":"'Spending Guides'!$A$9","v":" Debt (non mortgage)"},{"$f":"IF('Income Summary'!$G$13<20000,(HLOOKUP(20001,INDIRECT('Spending Guides'!$A$1),6,TRUE)),(HLOOKUP('Income Summary'!$G$13,INDIRECT('Spending Guides'!$A$1),6,TRUE)))","v":{"$error":"#REF!"}},{"$f":"IF('Income Summary'!$G$13<100000,HLOOKUP(('Income Summary'!$G$13+10000),INDIRECT('Spending Guides'!$A$1),6,TRUE),HLOOKUP('Income Summary'!$G$13+20000,INDIRECT('Spending Guides'!$A$1),6,TRUE))","v":{"$error":"#REF!"}}]
[{"$f":"'Current Spending Analysis'!A14","v":"RETIREMENT"},{"$f":"IF('Current Spending Analysis'!B14=0,\"\", 'Current Spending Analysis'!B14)","v":""}]
[{"$f":"'Current Spending Analysis'!A15","v":"[OTHER]"},{"$f":"IF('Current Spending Analysis'!B15=0,\"\", 'Current Spending Analysis'!B15)","v":""},null,{"$f":"G12 & \" Target\"","v":{"$error":"#REF!"}},null,{"$f":"'Spending Guides'!$A$11","v":" Housing"},{"$f":"IF('Income Summary'!$G$13<20000,(HLOOKUP(20001,INDIRECT('Spending Guides'!$A$1),8,TRUE)),(HLOOKUP('Income Summary'!$G$13,INDIRECT('Spending Guides'!$A$1),8,TRUE)))","v":{"$error":"#REF!"}},{"$f":"IF('Income Summary'!$G$13<100000,HLOOKUP(('Income Summary'!$G$13+10000),INDIRECT('Spending Guides'!$A$1),8,TRUE),HLOOKUP('Income Summary'!$G$13+20000,INDIRECT('Spending Guides'!$A$1),8,TRUE))","v":{"$error":"#REF!"}}]
["TOTAL SAVINGS",{"$f":"SUM(B12:B15)","v":0},{"$f":"SUM(C12:C15)","v":0},{"$f":"IFERROR((C16/'Income Summary'!$F$13),\"0.00%\")","v":"0.00%"},null,{"$f":"'Spending Guides'!$A$12","v":" Auto"},{"$f":"IF('Income Summary'!$G$13<20000,(HLOOKUP(20001,INDIRECT('Spending Guides'!$A$1),9,TRUE)),(HLOOKUP('Income Summary'!$G$13,INDIRECT('Spending Guides'!$A$1),9,TRUE)))","v":{"$error":"#REF!"}},{"$f":"IF('Income Summary'!$G$13<100000,HLOOKUP(('Income Summary'!$G$13+10000),INDIRECT('Spending Guides'!$A$1),9,TRUE),HLOOKUP('Income Summary'!$G$13+20000,INDIRECT('Spending Guides'!$A$1),9,TRUE))","v":{"$error":"#REF!"}}]
[null,null,null,null,null,{"$f":"'Spending Guides'!$A$13","v":" Insurance"},{"$f":"IF('Income Summary'!$G$13<20000,(HLOOKUP(20001,INDIRECT('Spending Guides'!$A$1),10,TRUE)),(HLOOKUP('Income Summary'!$G$13,INDIRECT('Spending Guides'!$A$1),10,TRUE)))","v":{"$error":"#REF!"}},{"$f":"IF('Income Summary'!$G$13<100000,HLOOKUP(('Income Summary'!$G$13+10000),INDIRECT('Spending Guides'!$A$1),10,TRUE),HLOOKUP('Income Summary'!$G$13+20000,INDIRECT('Spending Guides'!$A$1),10,TRUE))","v":{"$error":"#REF!"}}]
["DEBT SERVICE:",null,null,null,null,{"$f":"'Spending Guides'!$A$14","v":" Food"},{"$f":"IF('Income Summary'!$G$13<20000,(HLOOKUP(20001,INDIRECT('Spending Guides'!$A$1),11,TRUE)),(HLOOKUP('Income Summary'!$G$13,INDIRECT('Spending Guides'!$A$1),11,TRUE)))","v":{"$error":"#REF!"}},{"$f":"IF('Income Summary'!$G$13<100000,HLOOKUP(('Income Summary'!$G$13+10000),INDIRECT('Spending Guides'!$A$1),11,TRUE),HLOOKUP('Income Summary'!$G$13+20000,INDIRECT('Spending Guides'!$A$1),11,TRUE))","v":{"$error":"#REF!"}}]
[{"$f":"'Current Spending Analysis'!A19","v":"EDUCATION LOANS"},{"$f":"IF('Current Spending Analysis'!B19=0,\"\", 'Current Spending Analysis'!B19)","v":""},null,null,null,{"$f":"'Spending Guides'!$A$15","v":" Medical"},{"$f":"IF('Income Summary'!$G$13<20000,(HLOOKUP(20001,INDIRECT('Spending Guides'!$A$1),12,TRUE)),(HLOOKUP('Income Summary'!$G$13,INDIRECT('Spending Guides'!$A$1),12,TRUE)))","v":{"$error":"#REF!"}},{"$f":"IF('Income Summary'!$G$13<100000,HLOOKUP(('Income Summary'!$G$13+10000),INDIRECT('Spending Guides'!$A$1),12,TRUE),HLOOKUP('Income Summary'!$G$13+20000,INDIRECT('Spending Guides'!$A$1),12,TRUE))","v":{"$error":"#REF!"}}]
[{"$f":"'Current Spending Analysis'!A20","v":"CREDIT CARDS/PERSONAL NOTES"},{"$f":"IF('Current Spending Analysis'!B20=0,\"\", 'Current Spending Analysis'!B20)","v":""},null,null,null,{"$f":"'Spending Guides'!$A$16","v":" Children"},{"$f":"IF('Income Summary'!$G$13<20000,(HLOOKUP(20001,INDIRECT('Spending Guides'!$A$1),13,TRUE)),(HLOOKUP('Income Summary'!$G$13,INDIRECT('Spending Guides'!$A$1),13,TRUE)))","v":{"$error":"#REF!"}},{"$f":"IF('Income Summary'!$G$13<100000,HLOOKUP(('Income Summary'!$G$13+10000),INDIRECT('Spending Guides'!$A$1),13,TRUE),HLOOKUP('Income Summary'!$G$13+20000,INDIRECT('Spending Guides'!$A$1),13,TRUE))","v":{"$error":"#REF!"}}]
[{"$f":"'Current Spending Analysis'!A21","v":"[OTHER]"},{"$f":"IF('Current Spending Analysis'!B21=0,\"\", 'Current Spending Analysis'!B21)","v":""},null,null,null,{"$f":"'Spending Guides'!$A$17","v":" Clothing"},{"$f":"IF('Income Summary'!$G$13<20000,(HLOOKUP(20001,INDIRECT('Spending Guides'!$A$1),14,TRUE)),(HLOOKUP('Income Summary'!$G$13,INDIRECT('Spending Guides'!$A$1),14,TRUE)))","v":{"$error":"#REF!"}},{"$f":"IF('Income Summary'!$G$13<100000,HLOOKUP(('Income Summary'!$G$13+10000),INDIRECT('Spending Guides'!$A$1),14,TRUE),HLOOKUP('Income Summary'!$G$13+20000,INDIRECT('Spending Guides'!$A$1),14,TRUE))","v":{"$error":"#REF!"}}]
[{"$f":"'Current Spending Analysis'!A22","v":"[OTHER]"},{"$f":"IF('Current Spending Analysis'!B22=0,\"\", 'Current Spending Analysis'!B22)","v":""},null,{"$f":"G13 & \" Target\"","v":{"$error":"#REF!"}},null,{"$f":"'Spending Guides'!$A$18","v":"Entertainment"},{"$f":"IF('Income Summary'!$G$13<20000,(HLOOKUP(20001,INDIRECT('Spending Guides'!$A$1),15,TRUE)),(HLOOKUP('Income Summary'!$G$13,INDIRECT('Spending Guides'!$A$1),15,TRUE)))","v":{"$error":"#REF!"}},{"$f":"IF('Income Summary'!$G$13<100000,HLOOKUP(('Income Summary'!$G$13+10000),INDIRECT('Spending Guides'!$A$1),15,TRUE),HLOOKUP('Income Summary'!$G$13+20000,INDIRECT('Spending Guides'!$A$1),15,TRUE))","v":{"$error":"#REF!"}}]
["TOTAL DEBT",{"$f":"SUM(B19:B22)","v":0},{"$f":"SUM(C19:C22)","v":0},{"$f":"IFERROR((C23/'Income Summary'!$F$13),\"0.00%\")","v":"0.00%"},null,{"$f":"'Spending Guides'!$A$19","v":" Misc."},{"$f":"IF('Income Summary'!$G$13<20000,(HLOOKUP(20001,INDIRECT('Spending Guides'!$A$1),16,TRUE)),(HLOOKUP('Income Summary'!$G$13,INDIRECT('Spending Guides'!$A$1),16,TRUE)))","v":{"$error":"#REF!"}},{"$f":"IF('Income Summary'!$G$13<100000,HLOOKUP(('Income Summary'!$G$13+10000),INDIRECT('Spending Guides'!$A$1),16,TRUE),HLOOKUP('Income Summary'!$G$13+20000,INDIRECT('Spending Guides'!$A$1),16,TRUE))","v":{"$error":"#REF!"}}]
[]
["HOUSING:"]
[{"$f":"'Current Spending Analysis'!A26","v":"MORTGAGE/RENT"},{"$f":"IF('Current Spending Analysis'!B26=0,\"\", 'Current Spending Analysis'!B26)","v":""}]
[{"$f":"'Current Spending Analysis'!A27","v":"PROERTY TAXES"},{"$f":"IF('Current Spending Analysis'!B27=0,\"\", 'Current Spending Analysis'!B27)","v":""}]
[{"$f":"'Current Spending Analysis'!A28","v":"ELECTRICITY"},{"$f":"IF('Current Spending Analysis'!B28=0,\"\", 'Current Spending Analysis'!B28)","v":""}]
[{"$f":"'Current Spending Analysis'!A29","v":"NATURAL GAS"},{"$f":"IF('Current Spending Analysis'!B29=0,\"\", 'Current Spending Analysis'!B29)","v":""}]
[{"$f":"'Current Spending Analysis'!A30","v":"WATER"},{"$f":"IF('Current Spending Analysis'!B30=0,\"\", 'Current Spending Analysis'!B30)","v":""}]
[{"$f":"'Current Spending Analysis'!A31","v":"CONDO FEE/HOA"},{"$f":"IF('Current Spending Analysis'!B31=0,\"\", 'Current Spending Analysis'!B31)","v":""}]
[{"$f":"'Current Spending Analysis'!A32","v":"CELLPHONES"},{"$f":"IF('Current Spending Analysis'!B32=0,\"\", 'Current Spending Analysis'!B32)","v":""}]
[{"$f":"'Current Spending Analysis'!A33","v":"INTERNET/CABLE"},{"$f":"IF('Current Spending Analysis'!B33=0,\"\", 'Current Spending Analysis'!B33)","v":""}]
[{"$f":"'Current Spending Analysis'!A34","v":"CLEANING SERVICES"},{"$f":"IF('Current Spending Analysis'!B34=0,\"\", 'Current Spending Analysis'!B34)","v":""}]
[{"$f":"'Current Spending Analysis'!A35","v":"SEWER/TRASH"},{"$f":"IF('Current Spending Analysis'!B35=0,\"\", 'Current Spending Analysis'!B35)","v":""}]
[{"$f":"'Current Spending Analysis'!A36","v":"REPAIRS/IMPROVEMENT"},{"$f":"IF('Current Spending Analysis'!B36=0,\"\", 'Current Spending Analysis'!B36)","v":""}]
[{"$f":"'Current Spending Analysis'!A37","v":"FURNISHINGS"},{"$f":"IF('Current Spending Analysis'!B37=0,\"\", 'Current Spending Analysis'!B37)","v":""}]
[{"$f":"'Current Spending Analysis'!A38","v":"[OTHER]"},{"$f":"IF('Current Spending Analysis'!B38=0,\"\", 'Current Spending Analysis'!B38)","v":""}]
[{"$f":"'Current Spending Analysis'!A39","v":"[OTHER]"},{"$f":"IF('Current Spending Analysis'!B39=0,\"\", 'Current Spending Analysis'!B39)","v":""},null,{"$f":"G15 & \" Target\"","v":{"$error":"#REF!"}}]
["TOTAL HOUSING",{"$f":"SUM(B26:B39)","v":0},{"$f":"SUM(C26:C39)","v":0},{"$f":"IFERROR((C40/'Income Summary'!$F$13),\"0.00%\")","v":"0.00%"}]
[]
["TRANSPORTATION:"]
[{"$f":"'Current Spending Analysis'!A43","v":"GASOLINE"},{"$f":"IF('Current Spending Analysis'!B43=0,\"\", 'Current Spending Analysis'!B43)","v":""}]
[{"$f":"'Current Spending Analysis'!A44","v":"AUTO PAYMENTS/LEASE"},{"$f":"IF('Current Spending Analysis'!B44=0,\"\", 'Current Spending Analysis'!B44)","v":""}]
[{"$f":"'Current Spending Analysis'!A45","v":"MAINTENANCE & REPAIRS"},{"$f":"IF('Current Spending Analysis'!B45=0,\"\", 'Current Spending Analysis'!B45)","v":""}]
[{"$f":"'Current Spending Analysis'!A46","v":"PARKING/PUBLIC TRANSPORTATION"},{"$f":"IF('Current Spending Analysis'!B46=0,\"\", 'Current Spending Analysis'!B46)","v":""}]
[{"$f":"'Current Spending Analysis'!A47","v":"REGISTRATION/TAXES"},{"$f":"IF('Current Spending Analysis'!B47=0,\"\", 'Current Spending Analysis'!B47)","v":""}]
[{"$f":"'Current Spending Analysis'!A48","v":"[OTHER]"},{"$f":"IF('Current Spending Analysis'!B48=0,\"\", 'Current Spending Analysis'!B48)","v":""},null,{"$f":"G16 & \" Target\"","v":{"$error":"#REF!"}}]
["TOTAL TRANSPORTATION",{"$f":"SUM(B43:B48)","v":0},{"$f":"SUM(C43:C48)","v":0},{"$f":"IFERROR((C49/'Income Summary'!$F$13),\"0.00%\")","v":"0.00%"}]
[]
["INSURANCE:"]
[{"$f":"'Current Spending Analysis'!A52","v":"LIFE"},{"$f":"IF('Current Spending Analysis'!B52=0,\"\", 'Current Spending Analysis'!B52)","v":""}]
[{"$f":"'Current Spending Analysis'!A53","v":"DISABILITY"},{"$f":"IF('Current Spending Analysis'!B53=0,\"\", 'Current Spending Analysis'!B53)","v":""}]
[{"$f":"'Current Spending Analysis'!A54","v":"HEALTH PREMIUM"},{"$f":"IF('Current Spending Analysis'!B54=0,\"\", 'Current Spending Analysis'!B54)","v":""}]
[{"$f":"'Current Spending Analysis'!A55","v":"AUTOMOBILE"},{"$f":"IF('Current Spending Analysis'!B55=0,\"\", 'Current Spending Analysis'!B55)","v":""}]
[{"$f":"'Current Spending Analysis'!A56","v":"HOUSEHOLD"},{"$f":"IF('Current Spending Analysis'!B56=0,\"\", 'Current Spending Analysis'!B56)","v":""}]
[{"$f":"'Current Spending Analysis'!A57","v":"EXCESS LIABILITY"},{"$f":"IF('Current Spending Analysis'!B57=0,\"\", 'Current Spending Analysis'!B57)","v":""}]
[{"$f":"'Current Spending Analysis'!A58","v":"[OTHER]"},{"$f":"IF('Current Spending Analysis'!B58=0,\"\", 'Current Spending Analysis'!B58)","v":""}]
[{"$f":"'Current Spending Analysis'!A59","v":"[OTHER]"},{"$f":"IF('Current Spending Analysis'!B59=0,\"\", 'Current Spending Analysis'!B59)","v":""},null,{"$f":"G17& \" Target\"","v":{"$error":"#REF!"}}]
["TOTAL INSURANCE",{"$f":"SUM(B52:B59)","v":0},{"$f":"SUM(C52:C59)","v":0},{"$f":"IFERROR((C60/'Income Summary'!$F$13),\"0.00%\")","v":"0.00%"}]
[]
["FOOD:"]
[{"$f":"'Current Spending Analysis'!A63","v":"GROCERIES"},{"$f":"IF('Current Spending Analysis'!B63=0,\"\", 'Current Spending Analysis'!B63)","v":""}]
[{"$f":"'Current Spending Analysis'!A64","v":"RESTAURANTS"},{"$f":"IF('Current Spending Analysis'!B64=0,\"\", 'Current Spending Analysis'!B64)","v":""}]
[{"$f":"'Current Spending Analysis'!A65","v":"BARS/ALCOHOL"},{"$f":"IF('Current Spending Analysis'!B65=0,\"\", 'Current Spending Analysis'!B65)","v":""}]
[{"$f":"'Current Spending Analysis'!A66","v":"COFFEE SHOPS"},{"$f":"IF('Current Spending Analysis'!B66=0,\"\", 'Current Spending Analysis'!B66)","v":""}]
[{"$f":"'Current Spending Analysis'!A67","v":"[OTHER]"},{"$f":"IF('Current Spending Analysis'!B67=0,\"\", 'Current Spending Analysis'!B67)","v":""},null,{"$f":"G18 & \" Target\"","v":{"$error":"#REF!"}}]
["TOTAL FOOD",{"$f":"SUM(B63:B67)","v":0},{"$f":"SUM(C63:C67)","v":0},{"$f":"IFERROR((C68/'Income Summary'!$F$13),\"0.00%\")","v":"0.00%"}]
[]
["MEDICAL EXPENSES:"]
[{"$f":"'Current Spending Analysis'!A71","v":"PHYSICIANS"},{"$f":"IF('Current Spending Analysis'!B71=0,\"\", 'Current Spending Analysis'!B71)","v":""}]
[{"$f":"'Current Spending Analysis'!A72","v":"DENTISTS"},{"$f":"IF('Current Spending Analysis'!B72=0,\"\", 'Current Spending Analysis'!B72)","v":""}]
[{"$f":"'Current Spending Analysis'!A73","v":"PHARMACEUTICALS"},{"$f":"IF('Current Spending Analysis'!B73=0,\"\", 'Current Spending Analysis'!B73)","v":""}]
[{"$f":"'Current Spending Analysis'!A74","v":"VISION"},{"$f":"IF('Current Spending Analysis'!B74=0,\"\", 'Current Spending Analysis'!B74)","v":""}]
[{"$f":"'Current Spending Analysis'!A75","v":"[OTHER]"},{"$f":"IF('Current Spending Analysis'!B75=0,\"\", 'Current Spending Analysis'!B75)","v":""}]
[{"$f":"'Current Spending Analysis'!A76","v":"[OTHER]"},{"$f":"IF('Current Spending Analysis'!B76=0,\"\", 'Current Spending Analysis'!B76)","v":""},null,{"$f":"G19 & \" Target\"","v":{"$error":"#REF!"}}]
["TOTAL MEDICAL EXPENSES",{"$f":"SUM(B71:B76)","v":0},{"$f":"SUM(C71:C76)","v":0},{"$f":"IFERROR((C77/'Income Summary'!$F$13),\"0.00%\")","v":"0.00%"}]
[]
["CHILDREN'S EXPENSES:"]
[{"$f":"'Current Spending Analysis'!A80","v":"TUITION"},{"$f":"IF('Current Spending Analysis'!B80=0,\"\", 'Current Spending Analysis'!B80)","v":""}]
[{"$f":"'Current Spending Analysis'!A81","v":"SCHOOL LUNCHES"},{"$f":"IF('Current Spending Analysis'!B81=0,\"\", 'Current Spending Analysis'!B81)","v":""}]
[{"$f":"'Current Spending Analysis'!A82","v":"DAY CARE"},{"$f":"IF('Current Spending Analysis'!B82=0,\"\", 'Current Spending Analysis'!B82)","v":""}]
[{"$f":"'Current Spending Analysis'!A83","v":"ALLOWANCES"},{"$f":"IF('Current Spending Analysis'!B83=0,\"\", 'Current Spending Analysis'!B83)","v":""}]
[{"$f":"'Current Spending Analysis'!A84","v":"LESSONS"},{"$f":"IF('Current Spending Analysis'!B84=0,\"\", 'Current Spending Analysis'!B84)","v":""}]
[{"$f":"'Current Spending Analysis'!A85","v":"[OTHER]"},{"$f":"IF('Current Spending Analysis'!B85=0,\"\", 'Current Spending Analysis'!B85)","v":""}]
[{"$f":"'Current Spending Analysis'!A86","v":"[OTHER]"},{"$f":"IF('Current Spending Analysis'!B86=0,\"\", 'Current Spending Analysis'!B86)","v":""},null,{"$f":"G20 & \" Target\"","v":{"$error":"#REF!"}}]
["TOTAL CHILDREN'S EXPENSES",{"$f":"SUM(B80:B86)","v":0},{"$f":"SUM(C80:C86)","v":0},{"$f":"IFERROR((C87/'Income Summary'!$F$13),\"0.00%\")","v":"0.00%"}]
[]
["CLOTHING:"]
[{"$f":"'Current Spending Analysis'!A90","v":"[CLOTHING OTHER]"},{"$f":"IF('Current Spending Analysis'!B90=0,\"\", 'Current Spending Analysis'!B90)","v":""}]
[{"$f":"'Current Spending Analysis'!A91","v":"[CLOTHING OTHER]"},{"$f":"IF('Current Spending Analysis'!B91=0,\"\", 'Current Spending Analysis'!B91)","v":""},null,{"$f":"G21 & \" Target\"","v":{"$error":"#REF!"}}]
["TOTAL CLOTHING",{"$f":"SUM(B90:B91)","v":0},{"$f":"SUM(C90:C91)","v":0},{"$f":"IFERROR((C92/'Income Summary'!$F$13),\"0.00%\")","v":"0.00%"}]
[]
["ENTERTAINMENT:"]
[{"$f":"'Current Spending Analysis'!A95","v":"EVENINGS OUT"},{"$f":"IF('Current Spending Analysis'!B95=0,\"\", 'Current Spending Analysis'!B95)","v":""}]
[{"$f":"'Current Spending Analysis'!A96","v":"BABY SITTERS"},{"$f":"IF('Current Spending Analysis'!B96=0,\"\", 'Current Spending Analysis'!B96)","v":""}]
[{"$f":"'Current Spending Analysis'!A97","v":"MEDIA SUBSCRIPTIONS"},{"$f":"IF('Current Spending Analysis'!B97=0,\"\", 'Current Spending Analysis'!B97)","v":""}]
[{"$f":"'Current Spending Analysis'!A98","v":"PAPER SUBSCRIPTIONS"},{"$f":"IF('Current Spending Analysis'!B98=0,\"\", 'Current Spending Analysis'!B98)","v":""}]
[{"$f":"'Current Spending Analysis'!A99","v":"DUES/CLUBS/ACTIVITIES"},{"$f":"IF('Current Spending Analysis'!B99=0,\"\", 'Current Spending Analysis'!B99)","v":""}]
[{"$f":"'Current Spending Analysis'!A100","v":"VACATIONS"},{"$f":"IF('Current Spending Analysis'!B100=0,\"\", 'Current Spending Analysis'!B100)","v":""}]
[{"$f":"'Current Spending Analysis'!A101","v":"[OTHER]"},{"$f":"IF('Current Spending Analysis'!B101=0,\"\", 'Current Spending Analysis'!B101)","v":""}]
[{"$f":"'Current Spending Analysis'!A102","v":"[OTHER]"},{"$f":"IF('Current Spending Analysis'!B102=0,\"\", 'Current Spending Analysis'!B102)","v":""},null,{"$f":"G22 & \" Target\"","v":{"$error":"#REF!"}}]
["TOTAL ENTERTAINMENT",{"$f":"SUM(B95:B102)","v":0},{"$f":"SUM(C95:C102)","v":0},{"$f":"IFERROR((C103/'Income Summary'!$F$13),\"0.00%\")","v":"0.00%"}]
[]
["MISCELLANEOUS:"]
[{"$f":"'Current Spending Analysis'!A106","v":"TOILETRIES"},{"$f":"IF('Current Spending Analysis'!B106=0,\"\", 'Current Spending Analysis'!B106)","v":""}]
[{"$f":"'Current Spending Analysis'!A107","v":"DRY CLEANING"},{"$f":"IF('Current Spending Analysis'!B107=0,\"\", 'Current Spending Analysis'!B107)","v":""}]
[{"$f":"'Current Spending Analysis'!A108","v":"PROFESSIONAL FEES"},{"$f":"IF('Current Spending Analysis'!B108=0,\"\", 'Current Spending Analysis'!B108)","v":""}]
[{"$f":"'Current Spending Analysis'!A109","v":"ANIMALS"},{"$f":"IF('Current Spending Analysis'!B109=0,\"\", 'Current Spending Analysis'!B109)","v":""}]
[{"$f":"'Current Spending Analysis'!A110","v":"BEAUTY & BARBER"},{"$f":"IF('Current Spending Analysis'!B110=0,\"\", 'Current Spending Analysis'!B110)","v":""}]
[{"$f":"'Current Spending Analysis'!A111","v":"CASH ALLOWANCES"},{"$f":"IF('Current Spending Analysis'!B111=0,\"\", 'Current Spending Analysis'!B111)","v":""}]
[{"$f":"'Current Spending Analysis'!A112","v":"OTHER SERVICES"},{"$f":"IF('Current Spending Analysis'!B112=0,\"\", 'Current Spending Analysis'!B112)","v":""}]
[{"$f":"'Current Spending Analysis'!A113","v":"OTHER PURCHASES"},{"$f":"IF('Current Spending Analysis'!B113=0,\"\", 'Current Spending Analysis'!B113)","v":""}]
[{"$f":"'Current Spending Analysis'!A114","v":"[OTHER]"},{"$f":"IF('Current Spending Analysis'!B114=0,\"\", 'Current Spending Analysis'!B114)","v":""}]
[{"$f":"'Current Spending Analysis'!A115","v":"[OTHER]"},{"$f":"IF('Current Spending Analysis'!B115=0,\"\", 'Current Spending Analysis'!B115)","v":""},null,{"$f":"G23& \" Target\"","v":{"$error":"#REF!"}}]
["TOTAL MISCELLANEOUS",{"$f":"SUM(B106:B115)","v":0},{"$f":"SUM(C106:C115)","v":0},{"$f":"IFERROR((C116/'Income Summary'!$F$13),\"0.00%\")","v":"0.00%"}]
[]
[]
["SURPLUS / DEFICIT:"]
[null,"Current Spending"," ","Percentage"]
["TOTAL GROSS INCOME",{"$f":"'Income Summary'!$F$13","v":0},{"$f":"'Income Summary'!$F$13","v":0},1]
["TAXES & WITHHOLDING",{"$f":"'Income Summary'!$F$30","v":0},{"$f":"'Income Summary'!$F$30","v":0},{"$f":"'Income Summary'!H30","v":0}]
["NET INCOME",{"$f":"B121-B122","v":0},{"$f":"C121-C122","v":0},{"$f":"D121-D122","v":1}]
["TOTAL EXPENSES",{"$f":"SUM(B16,B23,B116,B9,B103,B87,B77,B92,B68,B60,B49,B40)","v":0},{"$f":"SUM(C16,C23,C116,C9,C103,C87,C77,C92,C68,C60,C49,C40)","v":0},{"$f":"C124/'Income Summary'!F13","v":{"$error":"#DIV/0!"}}]
["TOTAL SURPLUS / DEFICIT",{"$f":"B123-B124","v":0},{"$f":"C123-C124","v":0},{"$f":"D123-D124","v":{"$error":"#DIV/0!"}}]

{"sheet":"New Agreed Budget","index":24,"n_rows":125,"n_cols":10,"rows_kept":125,"cut":false,"hidden":false,"merged":[[0,0,0,5],[6,8,6,9]]}
["PERSONAL BUDGET "]
[null,"Current Spending","s Budget"," ","New Agreed Budget","% of Gross"]
["GIFTS:"]
[{"$f":"'Current Spending Analysis'!A4","v":"GIVING PLEDGE"},{"$f":"IF('Current Spending Analysis'!B4=0,\"\", 'Current Spending Analysis'!B4)","v":""},{"$f":"IF('Person 1 Budget'!C4=0,\"\", 'Person 1 Budget'!C4)","v":""},{"$f":"IF('Person 2 Budget'!C4=0,\"\", 'Person 2 Budget'!C4)","v":""}]
[{"$f":"'Current Spending Analysis'!A5","v":"CHARITIES"},{"$f":"IF('Current Spending Analysis'!B5=0,\"\", 'Current Spending Analysis'!B5)","v":""},{"$f":"IF('Person 1 Budget'!C5=0,\"\", 'Person 1 Budget'!C5)","v":""},{"$f":"IF('Person 2 Budget'!C5=0,\"\", 'Person 2 Budget'!C5)","v":""}]
[{"$f":"'Current Spending Analysis'!A6","v":"MISSIONARIES"},{"$f":"IF('Current Spending Analysis'!B6=0,\"\", 'Current Spending Analysis'!B6)","v":""},{"$f":"IF('Person 1 Budget'!C6=0,\"\", 'Person 1 Budget'!C6)","v":""},{"$f":"IF('Person 2 Budget'!C6=0,\"\", 'Person 2 Budget'!C6)","v":""}]
[{"$f":"'Current Spending Analysis'!A7","v":"CHRISTMAS/BIRTHDAYS"},{"$f":"IF('Current Spending Analysis'!B7=0,\"\", 'Current Spending Analysis'!B7)","v":""},{"$f":"IF('Person 1 Budget'!C7=0,\"\", 'Person 1 Budget'!C7)","v":""},{"$f":"IF('Person 2 Budget'!C7=0,\"\", 'Person 2 Budget'!C7)","v":""},null,null,null,null,"Spending Guide"]
[{"$f":"'Current Spending Analysis'!A8","v":"[OTHER]"},{"$f":"IF('Current Spending Analysis'!B8=0,\"\", 'Current Spending Analysis'!B8)","v":""},{"$f":"IF('Person 1 Budget'!C8=0,\"\", 'Person 1 Budget'!C8)","v":""},{"$f":"IF('Person 2 Budget'!C8=0,\"\", 'Person 2 Budget'!C8)","v":""},null,{"$f":"I11 & \" Target\"","v":{"$error":"#REF!"}},null,{"$f":"'Spending Guides'!$A$4","v":"Income Level"},{"$f":"IF('Income Summary'!$G$13<20000,(HLOOKUP(20001,INDIRECT('Spending Guides'!$A$1),1,TRUE)),(HLOOKUP('Income Summary'!$G$13,INDIRECT('Spending Guides'!$A$1),1,TRUE)))","v":{"$error":"#REF!"}},{"$f":"IF('Income Summary'!$G$13<100000,HLOOKUP(('Income Summary'!$G$13+10000),INDIRECT('Spending Guides'!$A$1),1,TRUE),HLOOKUP('Income Summary'!$G$13+20000,INDIRECT('Spending Guides'!$A$1),1,TRUE))","v":{"$error":"#REF!"}}]
["TOTAL GIFTS",{"$f":"SUM(B4:B8)","v":0},{"$f":"SUM(C4:C8)","v":0},{"$f":"SUM(D4:D8)","v":0},{"$f":"SUM(E4:E8)","v":0},{"$f":"IFERROR((E9/'Income Summary'!$F$13),\"0.00%\")","v":"0.00%"}]
[null,null,null,null,null,null,null,{"$f":"'Spending Guides'!$A$6","v":" Taxes"},{"$f":"IF('Income Summary'!$G$13<20000,(HLOOKUP(20001,INDIRECT('Spending Guides'!$A$1),3,TRUE)),(HLOOKUP('Income Summary'!$G$13,INDIRECT('Spending Guides'!$A$1),3,TRUE)))","v":{"$error":"#REF!"}},{"$f":"IF('Income Summary'!$G$13<100000,HLOOKUP(('Income Summary'!$G$13+10000),INDIRECT('Spending Guides'!$A$1),3,TRUE),HLOOKUP('Income Summary'!$G$13+20000,INDIRECT('Spending Guides'!$A$1),3,TRUE))","v":{"$error":"#REF!"}}]
["SAVINGS:",null,null,null,null,null,null,{"$f":"'Spending Guides'!$A$7","v":" Giving"},{"$f":"IF('Income Summary'!$G$13<20000,(HLOOKUP(20001,INDIRECT('Spending Guides'!$A$1),4,TRUE)),(HLOOKUP('Income Summary'!$G$13,INDIRECT('Spending Guides'!$A$1),4,TRUE)))","v":{"$error":"#REF!"}},{"$f":"IF('Income Summary'!$G$13<100000,HLOOKUP(('Income Summary'!$G$13+10000),INDIRECT('Spending Guides'!$A$1),4,TRUE),HLOOKUP('Income Summary'!$G$13+20000,INDIRECT('Spending Guides'!$A$1),4,TRUE))","v":{"$error":"#REF!"}}]
[{"$f":"'Current Spending Analysis'!A12","v":"GENERAL"},{"$f":"IF('Current Spending Analysis'!B12=0,\"\", 'Current Spending Analysis'!B12)","v":""},{"$f":"IF('Person 1 Budget'!C12=0,\"\", 'Person 1 Budget'!C12)","v":""},{"$f":"IF('Person 2 Budget'!C12=0,\"\", 'Person 2 Budget'!C12)","v":""},null,null,null,{"$f":"'Spending Guides'!$A$8","v":" Savings"},{"$f":"IF('Income Summary'!$G$13<20000,(HLOOKUP(20001,INDIRECT('Spending Guides'!$A$1),5,TRUE)),(HLOOKUP('Income Summary'!$G$13,INDIRECT('Spending Guides'!$A$1),5,TRUE)))","v":{"$error":"#REF!"}},{"$f":"IF('Income Summary'!$G$13<100000,HLOOKUP(('Income Summary'!$G$13+10000),INDIRECT('Spending Guides'!$A$1),5,TRUE),HLOOKUP('Income Summary'!$G$13+20000,INDIRECT('Spending Guides'!$A$1),5,TRUE))","v":{"$error":"#REF!"}}]
[{"$f":"'Current Spending Analysis'!A13","v":"EDUCATION"},{"$f":"IF('Current Spending Analysis'!B13=0,\"\", 'Current Spending Analysis'!B13)","v":""},{"$f":"IF('Person 1 Budget'!C13=0,\"\", 'Person 1 Budget'!C13)","v":""},{"$f":"IF('Person 2 Budget'!C13=0,\"\", 'Person 2 Budget'!C13)","v":""},null,null,null,{"$f":"'Spending Guides'!$A$9","v":" Debt (non mortgage)"},{"$f":"IF('Income Summary'!$G$13<20000,(HLOOKUP(20001,INDIRECT('Spending Guides'!$A$1),6,TRUE)),(HLOOKUP('Income Summary'!$G$13,INDIRECT('Spending Guides'!$A$1),6,TRUE)))","v":{"$error":"#REF!"}},{"$f":"IF('Income Summary'!$G$13<100000,HLOOKUP(('Income Summary'!$G$13+10000),INDIRECT('Spending Guides'!$A$1),6,TRUE),HLOOKUP('Income Summary'!$G$13+20000,INDIRECT('Spending Guides'!$A$1),6,TRUE))","v":{"$error":"#REF!"}}]
[{"$f":"'Current Spending Analysis'!A14","v":"RETIREMENT"},{"$f":"IF('Current Spending Analysis'!B14=0,\"\", 'Current Spending Analysis'!B14)","v":""},{"$f":"IF('Person 1 Budget'!C14=0,\"\", 'Person 1 Budget'!C14)","v":""},{"$f":"IF('Person 2 Budget'!C14=0,\"\", 'Person 2 Budget'!C14)","v":""}]
[{"$f":"'Current Spending Analysis'!A15","v":"[OTHER]"},{"$f":"IF('Current Spending Analysis'!B15=0,\"\", 'Current Spending Analysis'!B15)","v":""},{"$f":"IF('Person 1 Budget'!C15=0,\"\", 'Person 1 Budget'!C15)","v":""},{"$f":"IF('Person 2 Budget'!C15=0,\"\", 'Person 2 Budget'!C15)","v":""},null,{"$f":"I12 & \" Target\"","v":{"$error":"#REF!"}},null,{"$f":"'Spending Guides'!$A$11","v":" Housing"},{"$f":"IF('Income Summary'!$G$13<20000,(HLOOKUP(20001,INDIRECT('Spending Guides'!$A$1),8,TRUE)),(HLOOKUP('Income Summary'!$G$13,INDIRECT('Spending Guides'!$A$1),8,TRUE)))","v":{"$error":"#REF!"}},{"$f":"IF('Income Summary'!$G$13<100000,HLOOKUP(('Income Summary'!$G$13+10000),INDIRECT('Spending Guides'!$A$1),8,TRUE),HLOOKUP('Income Summary'!$G$13+20000,INDIRECT('Spending Guides'!$A$1),8,TRUE))","v":{"$error":"#REF!"}}]
["TOTAL SAVINGS",{"$f":"SUM(B12:B15)","v":0},{"$f":"SUM(C12:C15)","v":0},{"$f":"SUM(D12:D15)","v":0},{"$f":"SUM(E12:E15)","v":0},{"$f":"IFERROR((E16/'Income Summary'!$F$13),\"0.00%\")","v":"0.00%"},null,{"$f":"'Spending Guides'!$A$12","v":" Auto"},{"$f":"IF('Income Summary'!$G$13<20000,(HLOOKUP(20001,INDIRECT('Spending Guides'!$A$1),9,TRUE)),(HLOOKUP('Income Summary'!$G$13,INDIRECT('Spending Guides'!$A$1),9,TRUE)))","v":{"$error":"#REF!"}},{"$f":"IF('Income Summary'!$G$13<100000,HLOOKUP(('Income Summary'!$G$13+10000),INDIRECT('Spending Guides'!$A$1),9,TRUE),HLOOKUP('Income Summary'!$G$13+20000,INDIRECT('Spending Guides'!$A$1),9,TRUE))","v":{"$error":"#REF!"}}]
[null,null,null,null,null,null,null,{"$f":"'Spending Guides'!$A$13","v":" Insurance"},{"$f":"IF('Income Summary'!$G$13<20000,(HLOOKUP(20001,INDIRECT('Spending Guides'!$A$1),10,TRUE)),(HLOOKUP('Income Summary'!$G$13,INDIRECT('Spending Guides'!$A$1),10,TRUE)))","v":{"$error":"#REF!"}},{"$f":"IF('Income Summary'!$G$13<100000,HLOOKUP(('Income Summary'!$G$13+10000),INDIRECT('Spending Guides'!$A$1),10,TRUE),HLOOKUP('Income Summary'!$G$13+20000,INDIRECT('Spending Guides'!$A$1),10,TRUE))","v":{"$error":"#REF!"}}]
["DEBT SERVICE:",null,null,null,null,null,null,{"$f":"'Spending Guides'!$A$14","v":" Food"},{"$f":"IF('Income Summary'!$G$13<20000,(HLOOKUP(20001,INDIRECT('Spending Guides'!$A$1),11,TRUE)),(HLOOKUP('Income Summary'!$G$13,INDIRECT('Spending Guides'!$A$1),11,TRUE)))","v":{"$error":"#REF!"}},{"$f":"IF('Income Summary'!$G$13<100000,HLOOKUP(('Income Summary'!$G$13+10000),INDIRECT('Spending Guides'!$A$1),11,TRUE),HLOOKUP('Income Summary'!$G$13+20000,INDIRECT('Spending Guides'!$A$1),11,TRUE))","v":{"$error":"#REF!"}}]
[{"$f":"'Current Spending Analysis'!A19","v":"EDUCATION LOANS"},{"$f":"IF('Current Spending Analysis'!B19=0,\"\", 'Current Spending Analysis'!B19)","v":""},{"$f":"IF('Person 1 Budget'!C19=0,\"\", 'Person 1 Budget'!C19)","v":""},{"$f":"IF('Person 2 Budget'!C19=0,\"\", 'Person 2 Budget'!C19)","v":""},null,null,null,{"$f":"'Spending Guides'!$A$15","v":" Medical"},{"$f":"IF('Income Summary'!$G$13<20000,(HLOOKUP(20001,INDIRECT('Spending Guides'!$A$1),12,TRUE)),(HLOOKUP('Income Summary'!$G$13,INDIRECT('Spending Guides'!$A$1),12,TRUE)))","v":{"$error":"#REF!"}},{"$f":"IF('Income Summary'!$G$13<100000,HLOOKUP(('Income Summary'!$G$13+10000),INDIRECT('Spending Guides'!$A$1),12,TRUE),HLOOKUP('Income Summary'!$G$13+20000,INDIRECT('Spending Guides'!$A$1),12,TRUE))","v":{"$error":"#REF!"}}]
[{"$f":"'Current Spending Analysis'!A20","v":"CREDIT CARDS/PERSONAL NOTES"},{"$f":"IF('Current Spending Analysis'!B20=0,\"\", 'Current Spending Analysis'!B20)","v":""},{"$f":"IF('Person 1 Budget'!C20=0,\"\", 'Person 1 Budget'!C20)","v":""},{"$f":"IF('Person 2 Budget'!C20=0,\"\", 'Person 2 Budget'!C20)","v":""},null,null,null,{"$f":"'Spending Guides'!$A$16","v":" Children"},{"$f":"IF('Income Summary'!$G$13<20000,(HLOOKUP(20001,INDIRECT('Spending Guides'!$A$1),13,TRUE)),(HLOOKUP('Income Summary'!$G$13,INDIRECT('Spending Guides'!$A$1),13,TRUE)))","v":{"$error":"#REF!"}},{"$f":"IF('Income Summary'!$G$13<100000,HLOOKUP(('Income Summary'!$G$13+10000),INDIRECT('Spending Guides'!$A$1),13,TRUE),HLOOKUP('Income Summary'!$G$13+20000,INDIRECT('Spending Guides'!$A$1),13,TRUE))","v":{"$error":"#REF!"}}]
[{"$f":"'Current Spending Analysis'!A21","v":"[OTHER]"},{"$f":"IF('Current Spending Analysis'!B21=0,\"\", 'Current Spending Analysis'!B21)","v":""},{"$f":"IF('Person 1 Budget'!C21=0,\"\", 'Person 1 Budget'!C21)","v":""},{"$f":"IF('Person 2 Budget'!C21=0,\"\", 'Person 2 Budget'!C21)","v":""},null,null,null,{"$f":"'Spending Guides'!$A$17","v":" Clothing"},{"$f":"IF('Income Summary'!$G$13<20000,(HLOOKUP(20001,INDIRECT('Spending Guides'!$A$1),14,TRUE)),(HLOOKUP('Income Summary'!$G$13,INDIRECT('Spending Guides'!$A$1),14,TRUE)))","v":{"$error":"#REF!"}},{"$f":"IF('Income Summary'!$G$13<100000,HLOOKUP(('Income Summary'!$G$13+10000),INDIRECT('Spending Guides'!$A$1),14,TRUE),HLOOKUP('Income Summary'!$G$13+20000,INDIRECT('Spending Guides'!$A$1),14,TRUE))","v":{"$error":"#REF!"}}]
[{"$f":"'Current Spending Analysis'!A22","v":"[OTHER]"},{"$f":"IF('Current Spending Analysis'!B22=0,\"\", 'Current Spending Analysis'!B22)","v":""},{"$f":"IF('Person 1 Budget'!C22=0,\"\", 'Person 1 Budget'!C22)","v":""},{"$f":"IF('Person 2 Budget'!C22=0,\"\", 'Person 2 Budget'!C22)","v":""},null,{"$f":"I13 & \" Target\"","v":{"$error":"#REF!"}},null,{"$f":"'Spending Guides'!$A$18","v":"Entertainment"},{"$f":"IF('Income Summary'!$G$13<20000,(HLOOKUP(20001,INDIRECT('Spending Guides'!$A$1),15,TRUE)),(HLOOKUP('Income Summary'!$G$13,INDIRECT('Spending Guides'!$A$1),15,TRUE)))","v":{"$error":"#REF!"}},{"$f":"IF('Income Summary'!$G$13<100000,HLOOKUP(('Income Summary'!$G$13+10000),INDIRECT('Spending Guides'!$A$1),15,TRUE),HLOOKUP('Income Summary'!$G$13+20000,INDIRECT('Spending Guides'!$A$1),15,TRUE))","v":{"$error":"#REF!"}}]
["TOTAL DEBT",{"$f":"SUM(B19:B22)","v":0},{"$f":"SUM(C19:C22)","v":0},{"$f":"SUM(D19:D22)","v":0},{"$f":"SUM(E19:E22)","v":0},{"$f":"IFERROR((E23/'Income Summary'!$F$13),\"0.00%\")","v":"0.00%"},null,{"$f":"'Spending Guides'!$A$19","v":" Misc."},{"$f":"IF('Income Summary'!$G$13<20000,(HLOOKUP(20001,INDIRECT('Spending Guides'!$A$1),16,TRUE)),(HLOOKUP('Income Summary'!$G$13,INDIRECT('Spending Guides'!$A$1),16,TRUE)))","v":{"$error":"#REF!"}},{"$f":"IF('Income Summary'!$G$13<100000,HLOOKUP(('Income Summary'!$G$13+10000),INDIRECT('Spending Guides'!$A$1),16,TRUE),HLOOKUP('Income Summary'!$G$13+20000,INDIRECT('Spending Guides'!$A$1),16,TRUE))","v":{"$error":"#REF!"}}]
[]
["HOUSING:"]
[{"$f":"'Current Spending Analysis'!A26","v":"MORTGAGE/RENT"},{"$f":"IF('Current Spending Analysis'!B26=0,\"\", 'Current Spending Analysis'!B26)","v":""},{"$f":"IF('Person 1 Budget'!C26=0,\"\", 'Person 1 Budget'!C26)","v":""},{"$f":"IF('Person 2 Budget'!C26=0,\"\", 'Person 2 Budget'!C26)","v":""}]
[{"$f":"'Current Spending Analysis'!A27","v":"PROERTY TAXES"},{"$f":"IF('Current Spending Analysis'!B27=0,\"\", 'Current Spending Analysis'!B27)","v":""},{"$f":"IF('Person 1 Budget'!C27=0,\"\", 'Person 1 Budget'!C27)","v":""},{"$f":"IF('Person 2 Budget'!C27=0,\"\", 'Person 2 Budget'!C27)","v":""}]
[{"$f":"'Current Spending Analysis'!A28","v":"ELECTRICITY"},{"$f":"IF('Current Spending Analysis'!B28=0,\"\", 'Current Spending Analysis'!B28)","v":""},{"$f":"IF('Person 1 Budget'!C28=0,\"\", 'Person 1 Budget'!C28)","v":""},{"$f":"IF('Person 2 Budget'!C28=0,\"\", 'Person 2 Budget'!C28)","v":""}]
[{"$f":"'Current Spending Analysis'!A29","v":"NATURAL GAS"},{"$f":"IF('Current Spending Analysis'!B29=0,\"\", 'Current Spending Analysis'!B29)","v":""},{"$f":"IF('Person 1 Budget'!C29=0,\"\", 'Person 1 Budget'!C29)","v":""},{"$f":"IF('Person 2 Budget'!C29=0,\"\", 'Person 2 Budget'!C29)","v":""}]
[{"$f":"'Current Spending Analysis'!A30","v":"WATER"},{"$f":"IF('Current Spending Analysis'!B30=0,\"\", 'Current Spending Analysis'!B30)","v":""},{"$f":"IF('Person 1 Budget'!C30=0,\"\", 'Person 1 Budget'!C30)","v":""},{"$f":"IF('Person 2 Budget'!C30=0,\"\", 'Person 2 Budget'!C30)","v":""}]
[{"$f":"'Current Spending Analysis'!A31","v":"CONDO FEE/HOA"},{"$f":"IF('Current Spending Analysis'!B31=0,\"\", 'Current Spending Analysis'!B31)","v":""},{"$f":"IF('Person 1 Budget'!C31=0,\"\", 'Person 1 Budget'!C31)","v":""},{"$f":"IF('Person 2 Budget'!C31=0,\"\", 'Person 2 Budget'!C31)","v":""}]
[{"$f":"'Current Spending Analysis'!A32","v":"CELLPHONES"},{"$f":"IF('Current Spending Analysis'!B32=0,\"\", 'Current Spending Analysis'!B32)","v":""},{"$f":"IF('Person 1 Budget'!C32=0,\"\", 'Person 1 Budget'!C32)","v":""},{"$f":"IF('Person 2 Budget'!C32=0,\"\", 'Person 2 Budget'!C32)","v":""}]
[{"$f":"'Current Spending Analysis'!A33","v":"INTERNET/CABLE"},{"$f":"IF('Current Spending Analysis'!B33=0,\"\", 'Current Spending Analysis'!B33)","v":""},{"$f":"IF('Person 1 Budget'!C33=0,\"\", 'Person 1 Budget'!C33)","v":""},{"$f":"IF('Person 2 Budget'!C33=0,\"\", 'Person 2 Budget'!C33)","v":""}]
[{"$f":"'Current Spending Analysis'!A34","v":"CLEANING SERVICES"},{"$f":"IF('Current Spending Analysis'!B34=0,\"\", 'Current Spending Analysis'!B34)","v":""},{"$f":"IF('Person 1 Budget'!C34=0,\"\", 'Person 1 Budget'!C34)","v":""},{"$f":"IF('Person 2 Budget'!C34=0,\"\", 'Person 2 Budget'!C34)","v":""}]
[{"$f":"'Current Spending Analysis'!A35","v":"SEWER/TRASH"},{"$f":"IF('Current Spending Analysis'!B35=0,\"\", 'Current Spending Analysis'!B35)","v":""},{"$f":"IF('Person 1 Budget'!C35=0,\"\", 'Person 1 Budget'!C35)","v":""},{"$f":"IF('Person 2 Budget'!C35=0,\"\", 'Person 2 Budget'!C35)","v":""}]
[{"$f":"'Current Spending Analysis'!A36","v":"REPAIRS/IMPROVEMENT"},{"$f":"IF('Current Spending Analysis'!B36=0,\"\", 'Current Spending Analysis'!B36)","v":""},{"$f":"IF('Person 1 Budget'!C36=0,\"\", 'Person 1 Budget'!C36)","v":""},{"$f":"IF('Person 2 Budget'!C36=0,\"\", 'Person 2 Budget'!C36)","v":""}]
[{"$f":"'Current Spending Analysis'!A37","v":"FURNISHINGS"},{"$f":"IF('Current Spending Analysis'!B37=0,\"\", 'Current Spending Analysis'!B37)","v":""},{"$f":"IF('Person 1 Budget'!C37=0,\"\", 'Person 1 Budget'!C37)","v":""},{"$f":"IF('Person 2 Budget'!C37=0,\"\", 'Person 2 Budget'!C37)","v":""}]
[{"$f":"'Current Spending Analysis'!A38","v":"[OTHER]"},{"$f":"IF('Current Spending Analysis'!B38=0,\"\", 'Current Spending Analysis'!B38)","v":""},{"$f":"IF('Person 1 Budget'!C38=0,\"\", 'Person 1 Budget'!C38)","v":""},{"$f":"IF('Person 2 Budget'!C38=0,\"\", 'Person 2 Budget'!C38)","v":""}]
[{"$f":"'Current Spending Analysis'!A39","v":"[OTHER]"},{"$f":"IF('Current Spending Analysis'!B39=0,\"\", 'Current Spending Analysis'!B39)","v":""},{"$f":"IF('Person 1 Budget'!C39=0,\"\", 'Person 1 Budget'!C39)","v":""},{"$f":"IF('Person 2 Budget'!C39=0,\"\", 'Person 2 Budget'!C39)","v":""},null,{"$f":"I15 & \" Target\"","v":{"$error":"#REF!"}}]
["TOTAL HOUSING",{"$f":"SUM(B26:B39)","v":0},{"$f":"SUM(C26:C39)","v":0},{"$f":"SUM(D26:D39)","v":0},{"$f":"SUM(E26:E39)","v":0},{"$f":"IFERROR((E40/'Income Summary'!$F$13),\"0.00%\")","v":"0.00%"}]
[]
["TRANSPORTATION:"]
[{"$f":"'Current Spending Analysis'!A43","v":"GASOLINE"},{"$f":"IF('Current Spending Analysis'!B43=0,\"\", 'Current Spending Analysis'!B43)","v":""},{"$f":"IF('Person 1 Budget'!C43=0,\"\", 'Person 1 Budget'!C43)","v":""},{"$f":"IF('Person 2 Budget'!C43=0,\"\", 'Person 2 Budget'!C43)","v":""}]
[{"$f":"'Current Spending Analysis'!A44","v":"AUTO PAYMENTS/LEASE"},{"$f":"IF('Current Spending Analysis'!B44=0,\"\", 'Current Spending Analysis'!B44)","v":""},{"$f":"IF('Person 1 Budget'!C44=0,\"\", 'Person 1 Budget'!C44)","v":""},{"$f":"IF('Person 2 Budget'!C44=0,\"\", 'Person 2 Budget'!C44)","v":""}]
[{"$f":"'Current Spending Analysis'!A45","v":"MAINTENANCE & REPAIRS"},{"$f":"IF('Current Spending Analysis'!B45=0,\"\", 'Current Spending Analysis'!B45)","v":""},{"$f":"IF('Person 1 Budget'!C45=0,\"\", 'Person 1 Budget'!C45)","v":""},{"$f":"IF('Person 2 Budget'!C45=0,\"\", 'Person 2 Budget'!C45)","v":""}]
[{"$f":"'Current Spending Analysis'!A46","v":"PARKING/PUBLIC TRANSPORTATION"},{"$f":"IF('Current Spending Analysis'!B46=0,\"\", 'Current Spending Analysis'!B46)","v":""},{"$f":"IF('Person 1 Budget'!C46=0,\"\", 'Person 1 Budget'!C46)","v":""},{"$f":"IF('Person 2 Budget'!C46=0,\"\", 'Person 2 Budget'!C46)","v":""}]
[{"$f":"'Current Spending Analysis'!A47","v":"REGISTRATION/TAXES"},{"$f":"IF('Current Spending Analysis'!B47=0,\"\", 'Current Spending Analysis'!B47)","v":""},{"$f":"IF('Person 1 Budget'!C47=0,\"\", 'Person 1 Budget'!C47)","v":""},{"$f":"IF('Person 2 Budget'!C47=0,\"\", 'Person 2 Budget'!C47)","v":""}]
[{"$f":"'Current Spending Analysis'!A48","v":"[OTHER]"},{"$f":"IF('Current Spending Analysis'!B48=0,\"\", 'Current Spending Analysis'!B48)","v":""},{"$f":"IF('Person 1 Budget'!C48=0,\"\", 'Person 1 Budget'!C48)","v":""},{"$f":"IF('Person 2 Budget'!C48=0,\"\", 'Person 2 Budget'!C48)","v":""},null,{"$f":"I16 & \" Target\"","v":{"$error":"#REF!"}}]
["TOTAL TRANSPORTATION",{"$f":"SUM(B43:B48)","v":0},{"$f":"SUM(C43:C48)","v":0},{"$f":"SUM(D43:D48)","v":0},{"$f":"SUM(E43:E48)","v":0},{"$f":"IFERROR((E49/'Income Summary'!$F$13),\"0.00%\")","v":"0.00%"}]
[]
["INSURANCE:"]
[{"$f":"'Current Spending Analysis'!A52","v":"LIFE"},{"$f":"IF('Current Spending Analysis'!B52=0,\"\", 'Current Spending Analysis'!B52)","v":""},{"$f":"IF('Person 1 Budget'!C52=0,\"\", 'Person 1 Budget'!C52)","v":""},{"$f":"IF('Person 2 Budget'!C52=0,\"\", 'Person 2 Budget'!C52)","v":""}]
[{"$f":"'Current Spending Analysis'!A53","v":"DISABILITY"},{"$f":"IF('Current Spending Analysis'!B53=0,\"\", 'Current Spending Analysis'!B53)","v":""},{"$f":"IF('Person 1 Budget'!C53=0,\"\", 'Person 1 Budget'!C53)","v":""},{"$f":"IF('Person 2 Budget'!C53=0,\"\", 'Person 2 Budget'!C53)","v":""}]
[{"$f":"'Current Spending Analysis'!A54","v":"HEALTH PREMIUM"},{"$f":"IF('Current Spending Analysis'!B54=0,\"\", 'Current Spending Analysis'!B54)","v":""},{"$f":"IF('Person 1 Budget'!C54=0,\"\", 'Person 1 Budget'!C54)","v":""},{"$f":"IF('Person 2 Budget'!C54=0,\"\", 'Person 2 Budget'!C54)","v":""}]
[{"$f":"'Current Spending Analysis'!A55","v":"AUTOMOBILE"},{"$f":"IF('Current Spending Analysis'!B55=0,\"\", 'Current Spending Analysis'!B55)","v":""},{"$f":"IF('Person 1 Budget'!C55=0,\"\", 'Person 1 Budget'!C55)","v":""},{"$f":"IF('Person 2 Budget'!C55=0,\"\", 'Person 2 Budget'!C55)","v":""}]
[{"$f":"'Current Spending Analysis'!A56","v":"HOUSEHOLD"},{"$f":"IF('Current Spending Analysis'!B56=0,\"\", 'Current Spending Analysis'!B56)","v":""},{"$f":"IF('Person 1 Budget'!C56=0,\"\", 'Person 1 Budget'!C56)","v":""},{"$f":"IF('Person 2 Budget'!C56=0,\"\", 'Person 2 Budget'!C56)","v":""}]
[{"$f":"'Current Spending Analysis'!A57","v":"EXCESS LIABILITY"},{"$f":"IF('Current Spending Analysis'!B57=0,\"\", 'Current Spending Analysis'!B57)","v":""},{"$f":"IF('Person 1 Budget'!C57=0,\"\", 'Person 1 Budget'!C57)","v":""},{"$f":"IF('Person 2 Budget'!C57=0,\"\", 'Person 2 Budget'!C57)","v":""}]
[{"$f":"'Current Spending Analysis'!A58","v":"[OTHER]"},{"$f":"IF('Current Spending Analysis'!B58=0,\"\", 'Current Spending Analysis'!B58)","v":""},{"$f":"IF('Person 1 Budget'!C58=0,\"\", 'Person 1 Budget'!C58)","v":""},{"$f":"IF('Person 2 Budget'!C58=0,\"\", 'Person 2 Budget'!C58)","v":""}]
[{"$f":"'Current Spending Analysis'!A59","v":"[OTHER]"},{"$f":"IF('Current Spending Analysis'!B59=0,\"\", 'Current Spending Analysis'!B59)","v":""},{"$f":"IF('Person 1 Budget'!C59=0,\"\", 'Person 1 Budget'!C59)","v":""},{"$f":"IF('Person 2 Budget'!C59=0,\"\", 'Person 2 Budget'!C59)","v":""},null,{"$f":"I17 & \" Target\"","v":{"$error":"#REF!"}}]
["TOTAL INSURANCE",{"$f":"SUM(B52:B59)","v":0},{"$f":"SUM(C52:C59)","v":0},{"$f":"SUM(D52:D59)","v":0},{"$f":"SUM(E52:E59)","v":0},{"$f":"IFERROR((E60/'Income Summary'!$F$13),\"0.00%\")","v":"0.00%"}]
[]
["FOOD:"]
[{"$f":"'Current Spending Analysis'!A63","v":"GROCERIES"},{"$f":"IF('Current Spending Analysis'!B63=0,\"\", 'Current Spending Analysis'!B63)","v":""},{"$f":"IF('Person 1 Budget'!C63=0,\"\", 'Person 1 Budget'!C63)","v":""},{"$f":"IF('Person 2 Budget'!C63=0,\"\", 'Person 2 Budget'!C63)","v":""}]
[{"$f":"'Current Spending Analysis'!A64","v":"RESTAURANTS"},{"$f":"IF('Current Spending Analysis'!B64=0,\"\", 'Current Spending Analysis'!B64)","v":""},{"$f":"IF('Person 1 Budget'!C64=0,\"\", 'Person 1 Budget'!C64)","v":""},{"$f":"IF('Person 2 Budget'!C64=0,\"\", 'Person 2 Budget'!C64)","v":""}]
[{"$f":"'Current Spending Analysis'!A65","v":"BARS/ALCOHOL"},{"$f":"IF('Current Spending Analysis'!B65=0,\"\", 'Current Spending Analysis'!B65)","v":""},{"$f":"IF('Person 1 Budget'!C65=0,\"\", 'Person 1 Budget'!C65)","v":""},{"$f":"IF('Person 2 Budget'!C65=0,\"\", 'Person 2 Budget'!C65)","v":""}]
[{"$f":"'Current Spending Analysis'!A66","v":"COFFEE SHOPS"},{"$f":"IF('Current Spending Analysis'!B66=0,\"\", 'Current Spending Analysis'!B66)","v":""},{"$f":"IF('Person 1 Budget'!C66=0,\"\", 'Person 1 Budget'!C66)","v":""},{"$f":"IF('Person 2 Budget'!C66=0,\"\", 'Person 2 Budget'!C66)","v":""}]
[{"$f":"'Current Spending Analysis'!A67","v":"[OTHER]"},{"$f":"IF('Current Spending Analysis'!B67=0,\"\", 'Current Spending Analysis'!B67)","v":""},{"$f":"IF('Person 1 Budget'!C67=0,\"\", 'Person 1 Budget'!C67)","v":""},{"$f":"IF('Person 2 Budget'!C67=0,\"\", 'Person 2 Budget'!C67)","v":""},null,{"$f":"I18 & \" Target\"","v":{"$error":"#REF!"}}]
["TOTAL FOOD",{"$f":"SUM(B63:B67)","v":0},{"$f":"SUM(C63:C67)","v":0},{"$f":"SUM(D63:D67)","v":0},{"$f":"SUM(E63:E67)","v":0},{"$f":"IFERROR((E68/'Income Summary'!$F$13),\"0.00%\")","v":"0.00%"}]
[]
["MEDICAL EXPENSES:"]
[{"$f":"'Current Spending Analysis'!A71","v":"PHYSICIANS"},{"$f":"IF('Current Spending Analysis'!B71=0,\"\", 'Current Spending Analysis'!B71)","v":""},{"$f":"IF('Person 1 Budget'!C71=0,\"\", 'Person 1 Budget'!C71)","v":""},{"$f":"IF('Person 2 Budget'!C71=0,\"\", 'Person 2 Budget'!C71)","v":""}]
[{"$f":"'Current Spending Analysis'!A72","v":"DENTISTS"},{"$f":"IF('Current Spending Analysis'!B72=0,\"\", 'Current Spending Analysis'!B72)","v":""},{"$f":"IF('Person 1 Budget'!C72=0,\"\", 'Person 1 Budget'!C72)","v":""},{"$f":"IF('Person 2 Budget'!C72=0,\"\", 'Person 2 Budget'!C72)","v":""}]
[{"$f":"'Current Spending Analysis'!A73","v":"PHARMACEUTICALS"},{"$f":"IF('Current Spending Analysis'!B73=0,\"\", 'Current Spending Analysis'!B73)","v":""},{"$f":"IF('Person 1 Budget'!C73=0,\"\", 'Person 1 Budget'!C73)","v":""},{"$f":"IF('Person 2 Budget'!C73=0,\"\", 'Person 2 Budget'!C73)","v":""}]
[{"$f":"'Current Spending Analysis'!A74","v":"VISION"},{"$f":"IF('Current Spending Analysis'!B74=0,\"\", 'Current Spending Analysis'!B74)","v":""},{"$f":"IF('Person 1 Budget'!C74=0,\"\", 'Person 1 Budget'!C74)","v":""},{"$f":"IF('Person 2 Budget'!C74=0,\"\", 'Person 2 Budget'!C74)","v":""}]
[{"$f":"'Current Spending Analysis'!A75","v":"[OTHER]"},{"$f":"IF('Current Spending Analysis'!B75=0,\"\", 'Current Spending Analysis'!B75)","v":""},{"$f":"IF('Person 1 Budget'!C75=0,\"\", 'Person 1 Budget'!C75)","v":""},{"$f":"IF('Person 2 Budget'!C75=0,\"\", 'Person 2 Budget'!C75)","v":""}]
[{"$f":"'Current Spending Analysis'!A76","v":"[OTHER]"},{"$f":"IF('Current Spending Analysis'!B76=0,\"\", 'Current Spending Analysis'!B76)","v":""},{"$f":"IF('Person 1 Budget'!C76=0,\"\", 'Person 1 Budget'!C76)","v":""},{"$f":"IF('Person 2 Budget'!C76=0,\"\", 'Person 2 Budget'!C76)","v":""},null,{"$f":"I19 & \" Target\"","v":{"$error":"#REF!"}}]
["TOTAL MEDICAL EXPENSES",{"$f":"SUM(B71:B76)","v":0},{"$f":"SUM(C71:C76)","v":0},{"$f":"SUM(D71:D76)","v":0},{"$f":"SUM(E71:E76)","v":0},{"$f":"IFERROR((E77/'Income Summary'!$F$13),\"0.00%\")","v":"0.00%"}]
[]
["CHILDREN'S EXPENSES:"]
[{"$f":"'Current Spending Analysis'!A80","v":"TUITION"},{"$f":"IF('Current Spending Analysis'!B80=0,\"\", 'Current Spending Analysis'!B80)","v":""},{"$f":"IF('Person 1 Budget'!C80=0,\"\", 'Person 1 Budget'!C80)","v":""},{"$f":"IF('Person 2 Budget'!C80=0,\"\", 'Person 2 Budget'!C80)","v":""}]
[{"$f":"'Current Spending Analysis'!A81","v":"SCHOOL LUNCHES"},{"$f":"IF('Current Spending Analysis'!B81=0,\"\", 'Current Spending Analysis'!B81)","v":""},{"$f":"IF('Person 1 Budget'!C81=0,\"\", 'Person 1 Budget'!C81)","v":""},{"$f":"IF('Person 2 Budget'!C81=0,\"\", 'Person 2 Budget'!C81)","v":""}]
[{"$f":"'Current Spending Analysis'!A82","v":"DAY CARE"},{"$f":"IF('Current Spending Analysis'!B82=0,\"\", 'Current Spending Analysis'!B82)","v":""},{"$f":"IF('Person 1 Budget'!C82=0,\"\", 'Person 1 Budget'!C82)","v":""},{"$f":"IF('Person 2 Budget'!C82=0,\"\", 'Person 2 Budget'!C82)","v":""}]
[{"$f":"'Current Spending Analysis'!A83","v":"ALLOWANCES"},{"$f":"IF('Current Spending Analysis'!B83=0,\"\", 'Current Spending Analysis'!B83)","v":""},{"$f":"IF('Person 1 Budget'!C83=0,\"\", 'Person 1 Budget'!C83)","v":""},{"$f":"IF('Person 2 Budget'!C83=0,\"\", 'Person 2 Budget'!C83)","v":""}]
[{"$f":"'Current Spending Analysis'!A84","v":"LESSONS"},{"$f":"IF('Current Spending Analysis'!B84=0,\"\", 'Current Spending Analysis'!B84)","v":""},{"$f":"IF('Person 1 Budget'!C84=0,\"\", 'Person 1 Budget'!C84)","v":""},{"$f":"IF('Person 2 Budget'!C84=0,\"\", 'Person 2 Budget'!C84)","v":""}]
[{"$f":"'Current Spending Analysis'!A85","v":"[OTHER]"},{"$f":"IF('Current Spending Analysis'!B85=0,\"\", 'Current Spending Analysis'!B85)","v":""},{"$f":"IF('Person 1 Budget'!C85=0,\"\", 'Person 1 Budget'!C85)","v":""},{"$f":"IF('Person 2 Budget'!C85=0,\"\", 'Person 2 Budget'!C85)","v":""}]
[{"$f":"'Current Spending Analysis'!A86","v":"[OTHER]"},{"$f":"IF('Current Spending Analysis'!B86=0,\"\", 'Current Spending Analysis'!B86)","v":""},{"$f":"IF('Person 1 Budget'!C86=0,\"\", 'Person 1 Budget'!C86)","v":""},{"$f":"IF('Person 2 Budget'!C86=0,\"\", 'Person 2 Budget'!C86)","v":""},null,{"$f":"I20 & \" Target\"","v":{"$error":"#REF!"}}]
["TOTAL CHILDREN'S EXPENSES",{"$f":"SUM(B80:B86)","v":0},{"$f":"SUM(C80:C86)","v":0},{"$f":"SUM(D80:D86)","v":0},{"$f":"SUM(E80:E86)","v":0},{"$f":"IFERROR((E87/'Income Summary'!$F$13),\"0.00%\")","v":"0.00%"}]
[]
["CLOTHING:"]
[{"$f":"'Current Spending Analysis'!A90","v":"[CLOTHING OTHER]"},{"$f":"IF('Current Spending Analysis'!B90=0,\"\", 'Current Spending Analysis'!B90)","v":""},{"$f":"IF('Person 1 Budget'!C90=0,\"\", 'Person 1 Budget'!C90)","v":""},{"$f":"IF('Person 2 Budget'!C90=0,\"\", 'Person 2 Budget'!C90)","v":""}]
[{"$f":"'Current Spending Analysis'!A91","v":"[CLOTHING OTHER]"},{"$f":"IF('Current Spending Analysis'!B91=0,\"\", 'Current Spending Analysis'!B91)","v":""},{"$f":"IF('Person 1 Budget'!C91=0,\"\", 'Person 1 Budget'!C91)","v":""},{"$f":"IF('Person 2 Budget'!C91=0,\"\", 'Person 2 Budget'!C91)","v":""},null,{"$f":"I21 & \" Target\"","v":{"$error":"#REF!"}}]
["TOTAL CLOTHING",{"$f":"SUM(B90:B91)","v":0},{"$f":"SUM(C90:C91)","v":0},{"$f":"SUM(D90:D91)","v":0},{"$f":"SUM(E90:E91)","v":0},{"$f":"IFERROR((E92/'Income Summary'!$F$13),\"0.00%\")","v":"0.00%"}]
[]
["ENTERTAINMENT:"]
[{"$f":"'Current Spending Analysis'!A95","v":"EVENINGS OUT"},{"$f":"IF('Current Spending Analysis'!B95=0,\"\", 'Current Spending Analysis'!B95)","v":""},{"$f":"IF('Person 1 Budget'!C95=0,\"\", 'Person 1 Budget'!C95)","v":""},{"$f":"IF('Person 2 Budget'!C95=0,\"\", 'Person 2 Budget'!C95)","v":""}]
[{"$f":"'Current Spending Analysis'!A96","v":"BABY SITTERS"},{"$f":"IF('Current Spending Analysis'!B96=0,\"\", 'Current Spending Analysis'!B96)","v":""},{"$f":"IF('Person 1 Budget'!C96=0,\"\", 'Person 1 Budget'!C96)","v":""},{"$f":"IF('Person 2 Budget'!C96=0,\"\", 'Person 2 Budget'!C96)","v":""}]
[{"$f":"'Current Spending Analysis'!A97","v":"MEDIA SUBSCRIPTIONS"},{"$f":"IF('Current Spending Analysis'!B97=0,\"\", 'Current Spending Analysis'!B97)","v":""},{"$f":"IF('Person 1 Budget'!C97=0,\"\", 'Person 1 Budget'!C97)","v":""},{"$f":"IF('Person 2 Budget'!C97=0,\"\", 'Person 2 Budget'!C97)","v":""}]
[{"$f":"'Current Spending Analysis'!A98","v":"PAPER SUBSCRIPTIONS"},{"$f":"IF('Current Spending Analysis'!B98=0,\"\", 'Current Spending Analysis'!B98)","v":""},{"$f":"IF('Person 1 Budget'!C98=0,\"\", 'Person 1 Budget'!C98)","v":""},{"$f":"IF('Person 2 Budget'!C98=0,\"\", 'Person 2 Budget'!C98)","v":""}]
[{"$f":"'Current Spending Analysis'!A99","v":"DUES/CLUBS/ACTIVITIES"},{"$f":"IF('Current Spending Analysis'!B99=0,\"\", 'Current Spending Analysis'!B99)","v":""},{"$f":"IF('Person 1 Budget'!C99=0,\"\", 'Person 1 Budget'!C99)","v":""},{"$f":"IF('Person 2 Budget'!C99=0,\"\", 'Person 2 Budget'!C99)","v":""}]
[{"$f":"'Current Spending Analysis'!A100","v":"VACATIONS"},{"$f":"IF('Current Spending Analysis'!B100=0,\"\", 'Current Spending Analysis'!B100)","v":""},{"$f":"IF('Person 1 Budget'!C100=0,\"\", 'Person 1 Budget'!C100)","v":""},{"$f":"IF('Person 2 Budget'!C100=0,\"\", 'Person 2 Budget'!C100)","v":""}]
[{"$f":"'Current Spending Analysis'!A101","v":"[OTHER]"},{"$f":"IF('Current Spending Analysis'!B101=0,\"\", 'Current Spending Analysis'!B101)","v":""},{"$f":"IF('Person 1 Budget'!C101=0,\"\", 'Person 1 Budget'!C101)","v":""},{"$f":"IF('Person 2 Budget'!C101=0,\"\", 'Person 2 Budget'!C101)","v":""}]
[{"$f":"'Current Spending Analysis'!A102","v":"[OTHER]"},{"$f":"IF('Current Spending Analysis'!B102=0,\"\", 'Current Spending Analysis'!B102)","v":""},{"$f":"IF('Person 1 Budget'!C102=0,\"\", 'Person 1 Budget'!C102)","v":""},{"$f":"IF('Person 2 Budget'!C102=0,\"\", 'Person 2 Budget'!C102)","v":""},null,{"$f":"I22 & \" Target\"","v":{"$error":"#REF!"}}]
["TOTAL ENTERTAINMENT",{"$f":"SUM(B95:B102)","v":0},{"$f":"SUM(C95:C102)","v":0},{"$f":"SUM(D95:D102)","v":0},{"$f":"SUM(E95:E102)","v":0},{"$f":"IFERROR((E103/'Income Summary'!$F$13),\"0.00%\")","v":"0.00%"}]
[]
["MISCELLANEOUS:"]
[{"$f":"'Current Spending Analysis'!A106","v":"TOILETRIES"},{"$f":"IF('Current Spending Analysis'!B106=0,\"\", 'Current Spending Analysis'!B106)","v":""},{"$f":"IF('Person 1 Budget'!C106=0,\"\", 'Person 1 Budget'!C106)","v":""},{"$f":"IF('Person 2 Budget'!C106=0,\"\", 'Person 2 Budget'!C106)","v":""}]
[{"$f":"'Current Spending Analysis'!A107","v":"DRY CLEANING"},{"$f":"IF('Current Spending Analysis'!B107=0,\"\", 'Current Spending Analysis'!B107)","v":""},{"$f":"IF('Person 1 Budget'!C107=0,\"\", 'Person 1 Budget'!C107)","v":""},{"$f":"IF('Person 2 Budget'!C107=0,\"\", 'Person 2 Budget'!C107)","v":""}]
[{"$f":"'Current Spending Analysis'!A108","v":"PROFESSIONAL FEES"},{"$f":"IF('Current Spending Analysis'!B108=0,\"\", 'Current Spending Analysis'!B108)","v":""},{"$f":"IF('Person 1 Budget'!C108=0,\"\", 'Person 1 Budget'!C108)","v":""},{"$f":"IF('Person 2 Budget'!C108=0,\"\", 'Person 2 Budget'!C108)","v":""}]
[{"$f":"'Current Spending Analysis'!A109","v":"ANIMALS"},{"$f":"IF('Current Spending Analysis'!B109=0,\"\", 'Current Spending Analysis'!B109)","v":""},{"$f":"IF('Person 1 Budget'!C109=0,\"\", 'Person 1 Budget'!C109)","v":""},{"$f":"IF('Person 2 Budget'!C109=0,\"\", 'Person 2 Budget'!C109)","v":""}]
[{"$f":"'Current Spending Analysis'!A110","v":"BEAUTY & BARBER"},{"$f":"IF('Current Spending Analysis'!B110=0,\"\", 'Current Spending Analysis'!B110)","v":""},{"$f":"IF('Person 1 Budget'!C110=0,\"\", 'Person 1 Budget'!C110)","v":""},{"$f":"IF('Person 2 Budget'!C110=0,\"\", 'Person 2 Budget'!C110)","v":""}]
[{"$f":"'Current Spending Analysis'!A111","v":"CASH ALLOWANCES"},{"$f":"IF('Current Spending Analysis'!B111=0,\"\", 'Current Spending Analysis'!B111)","v":""},{"$f":"IF('Person 1 Budget'!C111=0,\"\", 'Person 1 Budget'!C111)","v":""},{"$f":"IF('Person 2 Budget'!C111=0,\"\", 'Person 2 Budget'!C111)","v":""}]
[{"$f":"'Current Spending Analysis'!A112","v":"OTHER SERVICES"},{"$f":"IF('Current Spending Analysis'!B112=0,\"\", 'Current Spending Analysis'!B112)","v":""},{"$f":"IF('Person 1 Budget'!C112=0,\"\", 'Person 1 Budget'!C112)","v":""},{"$f":"IF('Person 2 Budget'!C112=0,\"\", 'Person 2 Budget'!C112)","v":""}]
[{"$f":"'Current Spending Analysis'!A113","v":"OTHER PURCHASES"},{"$f":"IF('Current Spending Analysis'!B113=0,\"\", 'Current Spending Analysis'!B113)","v":""},{"$f":"IF('Person 1 Budget'!C113=0,\"\", 'Person 1 Budget'!C113)","v":""},{"$f":"IF('Person 2 Budget'!C113=0,\"\", 'Person 2 Budget'!C113)","v":""}]
[{"$f":"'Current Spending Analysis'!A114","v":"[OTHER]"},{"$f":"IF('Current Spending Analysis'!B114=0,\"\", 'Current Spending Analysis'!B114)","v":""},{"$f":"IF('Person 1 Budget'!C114=0,\"\", 'Person 1 Budget'!C114)","v":""},{"$f":"IF('Person 2 Budget'!C114=0,\"\", 'Person 2 Budget'!C114)","v":""}]
[{"$f":"'Current Spending Analysis'!A115","v":"[OTHER]"},{"$f":"IF('Current Spending Analysis'!B115=0,\"\", 'Current Spending Analysis'!B115)","v":""},{"$f":"IF('Person 1 Budget'!C115=0,\"\", 'Person 1 Budget'!C115)","v":""},{"$f":"IF('Person 2 Budget'!C115=0,\"\", 'Person 2 Budget'!C115)","v":""},null,{"$f":"I23 & \" Target\"","v":{"$error":"#REF!"}}]
["TOTAL MISCELLANEOUS",{"$f":"SUM(B106:B115)","v":0},{"$f":"SUM(C106:C115)","v":0},{"$f":"SUM(D106:D115)","v":0},{"$f":"SUM(E106:E115)","v":0},{"$f":"IFERROR((E116/'Income Summary'!$F$13),\"0.00%\")","v":"0.00%"}]
[]
[]
["SURPLUS / DEFICIT:"]
[null,"Current Budget","s Budget"," ","New Agreed Budget","Percentage"]
["TOTAL GROSS INCOME",{"$f":"'Income Summary'!$F$13","v":0},{"$f":"'Income Summary'!$F$13","v":0},{"$f":"'Income Summary'!$F$13","v":0},{"$f":"'Income Summary'!$F$13","v":0},1]
["TAXES & WITHHOLDING",{"$f":"'Income Summary'!$F$30","v":0},{"$f":"'Income Summary'!$F$30","v":0},{"$f":"'Income Summary'!$F$30","v":0},{"$f":"'Income Summary'!$F$30","v":0},{"$f":"'Income Summary'!H30","v":0}]
["NET INCOME",{"$f":"B121-B122","v":0},{"$f":"C121-C122","v":0},0,0,{"$f":"F121-F122","v":1}]
["TOTAL EXPENSES",{"$f":"SUM(B16,B23,B116,B9,B103,B87,B77,B92,B68,B60,B49,B40)","v":0},{"$f":"SUM(C16,C23,C116,C9,C103,C87,C77,C92,C68,C60,C49,C40)","v":0},0,0,{"$f":"E124/'Income Summary'!F13","v":{"$error":"#DIV/0!"}}]
["TOTAL SURPLUS / DEFICIT",{"$f":"B123-B124","v":0},{"$f":"C123-C124","v":0},{"$f":"D123-D124","v":0},{"$f":"E123-E124","v":0},{"$f":"F123-F124","v":{"$error":"#DIV/0!"}}]

{"sheet":"Balancing Note","index":25,"n_rows":30,"n_cols":2,"rows_kept":30,"cut":false,"hidden":false,"merged":[[20,1,23,7],[25,1,27,7],[29,1,31,7],[0,1,0,7],[2,1,3,7],[5,1,10,7],[12,1,18,7]]}
[null,"Balancing"]
[]
[null,"If you're having trouble getting your \"surplus/deficit\" number out of the Red there are some things you can do."]
[]
[]
[null,"First, use the percentages to find categories which may be commanding more of your total (gross) income.  Can you make changes to these categories?  Especially look at the more discretionary categories like entertainment, travel, or media subscriptions etc.  We don't recommend pushing these categories to zero, as we all need to have some recreation, but oftentimes, we find that people feel they \"need\" more entertainment than their income really allows."]
[]
[]
[]
[]
[]
[]
[null,"Second, if your discretionary spending is reasonable, take a look at your paycheck.  Are you a married couple with young children and contributing 10% per paycheck towards retirement?  It may be good to reduce retirement to have more money month to month.  Are you receiving a huge tax refund every year?  It may be good to adjust your tax withholding to put more money into your paycheck.  Any of these ideas should be checked with a knowledgeable person.  GIFT ministries can definitely help answer questions about adjusting your paycheck. "]
[]
[]
[]
[]
[]
[]
[]
[null,"Third, can your debts be negotiated?  While there is an important moral component to paying off your debts, you should try to contact your debtors to set up a plan that you can afford within your current income.  We've found that many creditors are willing to work with different payment options as you learn to live within your means."]
[]
[]
[]
[]
[null,"Fourth, is there a way to downsize some fixed lifestyle expenses?  Consider moving to a smaller house, terminating a lease on an expensive car, work on reducing your grocery budget, or adjusting your insurance \"needs.\""]
[]
[]
[]
[null,"Lastly, you can look at your goals for giving, saving, and debt repayment.  Sometimes we want to do more than our income allows.  Are your goals reasonable and in accordance with what you’ve been given?"]

{"sheet":"Recording Note","index":26,"n_rows":15,"n_cols":2,"rows_kept":15,"cut":false,"hidden":false,"merged":[[6,1,7,7],[9,1,13,7],[0,1,0,7],[2,1,4,7],[14,1,16,7]]}
[null,"Recording"]
[]
[null,"Perhaps the most important thing in the budgeting process is to record what you're spending consistently.  This will tell you how close to your budget you are, in which areas you were too optimistic in your budgeting, or where you need to make some adjustments.  "]
[]
[]
[]
[null,"We recommend finding some kind of spending tracking tool to help you keep track of your expenses moving forward."]
[]
[]
[null,"There are so many factors in getting a budget adjusted and keeping your priorities in line with God's will for your life.  It's important to keep these areas in proper balance as life situations change, which takes consistent commitment to living within God's will for us financially.  This includes making time to pray, talk, budget, and record."]
[]
[]
[]
[]
[null,"If you need any help or have any questions at all, please don't hesitate to contact GIFT Minsitries at www.giftministries.net.  We're here to help you work through anything that may come up!"]

{"sheet":"Retirement Calculations","index":27,"n_rows":206,"n_cols":108,"rows_kept":206,"cut":false,"hidden":true,"merged":[[1,100,1,107],[1,1,1,8],[1,10,1,17],[1,19,1,26],[1,28,1,35],[1,37,1,44],[1,46,1,53],[1,55,1,62],[1,64,1,71],[1,73,1,80],[1,82,1,89],[1,91,1,98],[89,2,89,8],[99,2,99,8],[109,2,109,9],[125,2,126,3],[127,2,129,3]]}
[]
[null,1,null,null,null,null,null,null,null,null,2,null,null,null,null,null,null,null,null,3,null,null,null,null,null,null,null,null,4,null,null,null,null,null,null,null,null,5,null,null,null,null,null,null,null,null,6,null,null,null,null,null,null,null,null,7,null,null,null,null,null,null,null,null,8,null,null,null,null,null,null,null,null,9,null,null,null,null,null,null,null,null,10,null,null,null,null,null,null,null,null,11,null,null,null,null,null,null,null,null,12]
["NAME:",null,{"$f":"IF(COUNTIF($I$92:$I$97,B2)=1,$C$87,IF(COUNTIF($I$102:$I$107,B2)=1,$C$88,\"\"))","v":""},null,null,null,null,null,null,null,null,{"$f":"IF(COUNTIF($I$92:$I$97,K2)=1,$C$87,IF(COUNTIF($I$102:$I$107,K2)=1,$C$88,\"\"))","v":""},null,null,null,null,null,null,null,null,{"$f":"IF(COUNTIF($I$92:$I$97,T2)=1,$C$87,IF(COUNTIF($I$102:$I$107,T2)=1,$C$88,\"\"))","v":""},null,null,null,null,null,null,null,null,{"$f":"IF(COUNTIF($I$92:$I$97,AC2)=1,$C$87,IF(COUNTIF($I$102:$I$107,AC2)=1,$C$88,\"\"))","v":""},null,null,null,null,null,null,null,null,{"$f":"IF(COUNTIF($I$92:$I$97,AL2)=1,$C$87,IF(COUNTIF($I$102:$I$107,AL2)=1,$C$88,\"\"))","v":""},null,null,null,null,null,null,null,null,{"$f":"IF(COUNTIF($I$92:$I$97,AU2)=1,$C$87,IF(COUNTIF($I$102:$I$107,AU2)=1,$C$88,\"\"))","v":""},null,null,null,null,null,null,null,null,{"$f":"IF(COUNTIF($I$92:$I$97,BD2)=1,$C$87,IF(COUNTIF($I$102:$I$107,BD2)=1,$C$88,\"\"))","v":""},null,null,null,null,null,null,null,null,{"$f":"IF(COUNTIF($I$92:$I$97,BM2)=1,$C$87,IF(COUNTIF($I$102:$I$107,BM2)=1,$C$88,\"\"))","v":""},null,null,null,null,null,null,null,null,{"$f":"IF(COUNTIF($I$92:$I$97,BV2)=1,$C$87,IF(COUNTIF($I$102:$I$107,BV2)=1,$C$88,\"\"))","v":""},null,null,null,null,null,null,null,null,{"$f":"IF(COUNTIF($I$92:$I$97,CE2)=1,$C$87,IF(COUNTIF($I$102:$I$107,CE2)=1,$C$88,\"\"))","v":""},null,null,null,null,null,null,null,null,{"$f":"IF(COUNTIF($I$92:$I$97,CN2)=1,$C$87,IF(COUNTIF($I$102:$I$107,CN2)=1,$C$88,\"\"))","v":""},null,null,null,null,null,null,null,null,{"$f":"IF(COUNTIF($I$92:$I$97,CW2)=1,$C$87,IF(COUNTIF($I$102:$I$107,CW2)=1,$C$88,\"\"))","v":""}]
["ACCOUNT:",null,{"$f":"INDEX($C$92:$J$107,MATCH(B2,$I$92:$I$107,0),1)","v":{"$error":"#N/A"}},null,null,null,null,null,{"$f":"C3","v":""},null,null,{"$f":"INDEX($C$92:$I$107,MATCH(K2,$I$92:$I$107,0),1)","v":{"$error":"#N/A"}},null,null,null,null,null,{"$f":"L3","v":""},null,null,{"$f":"INDEX($C$92:$I$107,MATCH(T2,$I$92:$I$107,0),1)","v":{"$error":"#N/A"}},null,null,null,null,null,{"$f":"U3","v":""},null,null,{"$f":"INDEX($C$92:$I$107,MATCH(AC2,$I$92:$I$107,0),1)","v":{"$error":"#N/A"}},null,null,null,null,null,{"$f":"AD3","v":""},null,null,{"$f":"INDEX($C$92:$I$107,MATCH(AL2,$I$92:$I$107,0),1)","v":{"$error":"#N/A"}},null,null,null,null,null,{"$f":"AM3","v":""},null,null,{"$f":"INDEX($C$92:$I$107,MATCH(AU2,$I$92:$I$107,0),1)","v":{"$error":"#N/A"}},null,null,null,null,null,{"$f":"AV3","v":""},null,null,{"$f":"INDEX($C$92:$I$107,MATCH(BD2,$I$92:$I$107,0),1)","v":{"$error":"#N/A"}},null,null,null,null,null,{"$f":"BE3","v":""},null,null,{"$f":"INDEX($C$92:$I$107,MATCH(BM2,$I$92:$I$107,0),1)","v":{"$error":"#N/A"}},null,null,null,null,null,{"$f":"BN3","v":""},null,null,{"$f":"INDEX($C$92:$I$107,MATCH(BV2,$I$92:$I$107,0),1)","v":{"$error":"#N/A"}},null,null,null,null,null,{"$f":"BW3","v":""},null,null,{"$f":"INDEX($C$92:$I$107,MATCH(CE2,$I$92:$I$107,0),1)","v":{"$error":"#N/A"}},null,null,null,null,null,{"$f":"CF3","v":""},null,null,{"$f":"INDEX($C$92:$I$107,MATCH(CN2,$I$92:$I$107,0),1)","v":{"$error":"#N/A"}},null,null,null,null,null,{"$f":"CO3","v":""},null,null,{"$f":"INDEX($C$92:$I$107,MATCH(CW2,$I$92:$I$107,0),1)","v":{"$error":"#N/A"}},null,null,null,null,null,{"$f":"CX3","v":""}]
["BALANCE:",null,{"$f":"INDEX($C$92:$J$107,MATCH(B2,$I$92:$I$107,0),3)","v":{"$error":"#N/A"}},null,null,null,null,null,null,null,null,{"$f":"INDEX($C$92:$I$107,MATCH(K2,$I$92:$I$107,0),3)","v":{"$error":"#N/A"}},null,null,null,null,null,null,null,null,{"$f":"INDEX($C$92:$I$107,MATCH(T2,$I$92:$I$107,0),3)","v":{"$error":"#N/A"}},null,null,null,null,null,null,null,null,{"$f":"INDEX($C$92:$I$107,MATCH(AC2,$I$92:$I$107,0),3)","v":{"$error":"#N/A"}},null,null,null,null,null,null,null,null,{"$f":"INDEX($C$92:$I$107,MATCH(AL2,$I$92:$I$107,0),3)","v":{"$error":"#N/A"}},null,null,null,null,null,null,null,null,{"$f":"INDEX($C$92:$I$107,MATCH(AU2,$I$92:$I$107,0),3)","v":{"$error":"#N/A"}},null,null,null,null,null,null,null,null,{"$f":"INDEX($C$92:$I$107,MATCH(BD2,$I$92:$I$107,0),3)","v":{"$error":"#N/A"}},null,null,null,null,null,null,null,null,{"$f":"INDEX($C$92:$I$107,MATCH(BM2,$I$92:$I$107,0),3)","v":{"$error":"#N/A"}},null,null,null,null,null,null,null,null,{"$f":"INDEX($C$92:$I$107,MATCH(BV2,$I$92:$I$107,0),3)","v":{"$error":"#N/A"}},null,null,null,null,null,null,null,null,{"$f":"INDEX($C$92:$I$107,MATCH(CE2,$I$92:$I$107,0),3)","v":{"$error":"#N/A"}},null,null,null,null,null,null,null,null,{"$f":"INDEX($C$92:$I$107,MATCH(CN2,$I$92:$I$107,0),3)","v":{"$error":"#N/A"}},null,null,null,null,null,null,null,null,{"$f":"INDEX($C$92:$I$107,MATCH(CW2,$I$92:$I$107,0),3)","v":{"$error":"#N/A"}}]
["CONTR.:",null,{"$f":"INDEX($C$92:$J$107,MATCH(B2,$I$92:$I$107,0),6)","v":{"$error":"#N/A"}},null,null,null,null,null,null,null,null,{"$f":"INDEX($C$92:$I$107,MATCH(K2,$I$92:$I$107,0),6)","v":{"$error":"#N/A"}},null,null,null,null,null,null,null,null,{"$f":"INDEX($C$92:$I$107,MATCH(T2,$I$92:$I$107,0),6)","v":{"$error":"#N/A"}},null,null,null,null,null,null,null,null,{"$f":"INDEX($C$92:$I$107,MATCH(AC2,$I$92:$I$107,0),6)","v":{"$error":"#N/A"}},null,null,null,null,null,null,null,null,{"$f":"INDEX($C$92:$I$107,MATCH(AL2,$I$92:$I$107,0),6)","v":{"$error":"#N/A"}},null,null,null,null,null,null,null,null,{"$f":"INDEX($C$92:$I$107,MATCH(AU2,$I$92:$I$107,0),6)","v":{"$error":"#N/A"}},null,null,null,null,null,null,null,null,{"$f":"INDEX($C$92:$I$107,MATCH(BD2,$I$92:$I$107,0),6)","v":{"$error":"#N/A"}},null,null,null,null,null,null,null,null,{"$f":"INDEX($C$92:$I$107,MATCH(BM2,$I$92:$I$107,0),6)","v":{"$error":"#N/A"}},null,null,null,null,null,null,null,null,{"$f":"INDEX($C$92:$I$107,MATCH(BV2,$I$92:$I$107,0),6)","v":{"$error":"#N/A"}},null,null,null,null,null,null,null,null,{"$f":"INDEX($C$92:$I$107,MATCH(CE2,$I$92:$I$107,0),6)","v":{"$error":"#N/A"}},null,null,null,null,null,null,null,null,{"$f":"INDEX($C$92:$I$107,MATCH(CN2,$I$92:$I$107,0),6)","v":{"$error":"#N/A"}},null,null,null,null,null,null,null,null,{"$f":"INDEX($C$92:$I$107,MATCH(CW2,$I$92:$I$107,0),6)","v":{"$error":"#N/A"}}]
["Pre-Rate Ex."]
["Post-Rate Ex."]
[]
["Year","AGE","BAL","WTHDRW","LEFT","CONTR","ROR","GRWTH","END BAL",null,"AGE","BAL","WTHDRW","LEFT","CONTR","ROR","GRWTH","END BAL",null,"AGE","BAL","WTHDRW","LEFT","CONTR","ROR","GRWTH","END BAL",null,"AGE","BAL","WTHDRW","LEFT","CONTR","ROR","GRWTH","END BAL",null,"AGE","BAL","WTHDRW","LEFT","CONTR","ROR","GRWTH","END BAL",null,"AGE","BAL","WTHDRW","LEFT","CONTR","ROR","GRWTH","END BAL",null,"AGE","BAL","WTHDRW","LEFT","CONTR","ROR","GRWTH","END BAL",null,"AGE","BAL","WTHDRW","LEFT","CONTR","ROR","GRWTH","END BAL",null,"AGE","BAL","WTHDRW","LEFT","CONTR","ROR","GRWTH","END BAL",null,"AGE","BAL","WTHDRW","LEFT","CONTR","ROR","GRWTH","END BAL",null,"AGE","BAL","WTHDRW","LEFT","CONTR","ROR","GRWTH","END BAL",null,"AGE","BAL","WTHDRW","LEFT","CONTR","ROR","GRWTH","END BAL"]
[]
[{"$f":"A136","v":2020},{"$f":"INDEX($A$135:$C$206,MATCH(A12,$A$135:$A$206,0),MATCH(CONCATENATE(C3,\"'\",\"s\",\" Age\"),$135:$135,0))","v":""},{"$f":"C5","v":{"$error":"#N/A"}},{"$f":"IF(INDEX($A$135:$W$206,MATCH(A12,$A$135:$A$206,0),MATCH($Q$135,$135:$135,0))>0,0,INDEX($A$135:$W$206,MATCH(A12,$A$135:$A$206,0),MATCH($Q$135,$135:$135,0)))","v":{"$error":"#VALUE!"}},{"$f":"SUM(C12:D12)","v":{"$error":"#N/A"}},{"$f":"IF(E12<=0,0,IF(B12<INDEX($C$87:$G$88,MATCH($C$3,$C$87:$C$88,0),5),$C$6,0))","v":{"$error":"#N/A"}},{"$f":"IF($C$7=\"\",IF(B12<INDEX($C$87:$G$88,MATCH($C$3,$C$87:$C$88,0),5),$L$98,$L$99),IF(B12<INDEX($C$87:$G$88,MATCH($C$3,$C$87:$C$88,0),5),$C$7,$C$8))","v":0.04},{"$f":"IF(G12*SUM(E12:F12)<0,0,G12*SUM(E12:F12))","v":{"$error":"#N/A"}},{"$f":"IF(SUM(E12:F12,H12)<0,0,SUM(E12:F12,H12))","v":{"$error":"#N/A"}},null,{"$f":"INDEX($A$135:$C$206,MATCH($A$12,$A$135:$A$206,0),MATCH(CONCATENATE(L3,\"'\",\"s\",\" Age\"),$135:$135,0))","v":""},{"$f":"L5","v":{"$error":"#N/A"}},{"$f":"IF(INDEX($A$135:$W$206,MATCH(A12,$A$135:$A$206,0),MATCH($Q$135,$135:$135,0))>0,0,INDEX($A$135:$W$206,MATCH(A12,$A$135:$A$206,0),MATCH($Q$135,$135:$135,0)))","v":{"$error":"#VALUE!"}},{"$f":"SUM(L12:M12)","v":{"$error":"#N/A"}},{"$f":"IF(N12<=0,0,IF(K12<INDEX($C$87:$G$88,MATCH($L$3,$C$87:$C$88,0),5),$L$6,0))","v":{"$error":"#N/A"}},{"$f":"IF($L$7=\"\",IF(K12<INDEX($C$87:$G$88,MATCH($L$3,$C$87:$C$88,0),5),$L$98,$L$99),IF(K12<INDEX($C$87:$G$88,MATCH($L$3,$C$87:$C$88,0),5),$L$7,$L$8))","v":0.04},{"$f":"IF(P12*SUM(N12:O12)<0,0,P12*SUM(N12:O12))","v":{"$error":"#N/A"}},{"$f":"IF(SUM(N12:O12,Q12)<0,0,(SUM(N12:O12,Q12)))","v":{"$error":"#N/A"}},null,{"$f":"INDEX($A$135:$C$206,MATCH($A$12,$A$135:$A$206,0),MATCH(CONCATENATE(U3,\"'\",\"s\",\" Age\"),$135:$135,0))","v":""},{"$f":"U5","v":{"$error":"#N/A"}},{"$f":"IF(INDEX($A$135:$W$206,MATCH(A12,$A$135:$A$206,0),MATCH($Q$135,$135:$135,0))>0,0,INDEX($A$135:$W$206,MATCH(A12,$A$135:$A$206,0),MATCH($Q$135,$135:$135,0)))","v":{"$error":"#VALUE!"}},{"$f":"SUM(U12:V12)","v":{"$error":"#N/A"}},{"$f":"IF(W12<=0,0,IF(T12<INDEX($C$87:$G$88,MATCH($U$3,$C$87:$C$88,0),5),$U$6,0))","v":{"$error":"#N/A"}},{"$f":"IF($U$7=\"\",IF(T12<INDEX($C$87:$G$88,MATCH($U$3,$C$87:$C$88,0),5),$L$98,$L$99),IF(T12<INDEX($C$87:$G$88,MATCH($U$3,$C$87:$C$88,0),5),$U$7,$U$8))","v":0.04},{"$f":"IF(Y12*SUM(W12:X12)<0,0,Y12*SUM(W12:X12))","v":{"$error":"#N/A"}},{"$f":"IF(SUM(W12:X12,Z12)<0,0,(SUM(W12:X12,Z12)))","v":{"$error":"#N/A"}},null,{"$f":"INDEX($A$135:$C$206,MATCH($A$12,$A$135:$A$206,0),MATCH(CONCATENATE(AD3,\"'\",\"s\",\" Age\"),$135:$135,0))","v":""},{"$f":"AD5","v":{"$error":"#N/A"}},{"$f":"IF(INDEX($A$135:$W$206,MATCH(A12,$A$135:$A$206,0),MATCH($Q$135,$135:$135,0))>0,0,INDEX($A$135:$W$206,MATCH(A12,$A$135:$A$206,0),MATCH($Q$135,$135:$135,0)))","v":{"$error":"#VALUE!"}},{"$f":"SUM(AD12:AE12)","v":{"$error":"#N/A"}},{"$f":"IF(AF12<=0,0,IF(AC12<INDEX($C$87:$G$88,MATCH($AD$3,$C$87:$C$88,0),5),$AD$6,0))","v":{"$error":"#N/A"}},{"$f":"IF($AD$7=\"\",IF(AC12<INDEX($C$87:$G$88,MATCH($AD$3,$C$87:$C$88,0),5),$L$98,$L$99),IF(AC12<INDEX($C$87:$G$88,MATCH($AD$3,$C$87:$C$88,0),5),$AD$7,$AD$8))","v":0.04},{"$f":"IF(AH12*SUM(AF12:AG12)<0,0,AH12*SUM(AF12:AG12))","v":{"$error":"#N/A"}},{"$f":"IF(SUM(AF12:AG12,AI12)<0,0,(SUM(AF12:AG12,AI12)))","v":{"$error":"#N/A"}},null,{"$f":"INDEX($A$135:$C$206,MATCH($A$12,$A$135:$A$206,0),MATCH(CONCATENATE(AM3,\"'\",\"s\",\" Age\"),$135:$135,0))","v":""},{"$f":"AM5","v":{"$error":"#N/A"}},{"$f":"IF(INDEX($A$135:$W$206,MATCH(A12,$A$135:$A$206,0),MATCH($Q$135,$135:$135,0))>0,0,INDEX($A$135:$W$206,MATCH(A12,$A$135:$A$206,0),MATCH($Q$135,$135:$135,0)))","v":{"$error":"#VALUE!"}},{"$f":"SUM(AM12:AN12)","v":{"$error":"#N/A"}},{"$f":"IF(AO12<=0,0,IF(AL12<INDEX($C$87:$G$88,MATCH($AM$3,$C$87:$C$88,0),5),$AM$6,0))","v":{"$error":"#N/A"}},{"$f":"IF($AM$7=\"\",IF(AL12<INDEX($C$87:$G$88,MATCH($AM$3,$C$87:$C$88,0),5),$L$98,$L$99),IF(AL12<INDEX($C$87:$G$88,MATCH($AM$3,$C$87:$C$88,0),5),$AM$7,$AM$8))","v":0.04},{"$f":"IF(AQ12*SUM(AO12:AP12)<0,0,AQ12*SUM(AO12:AP12))","v":{"$error":"#N/A"}},{"$f":"IF(SUM(AO12:AP12,AR12)<0,0,(SUM(AO12:AP12,AR12)))","v":{"$error":"#N/A"}},null,{"$f":"INDEX($A$135:$C$206,MATCH($A$12,$A$135:$A$206,0),MATCH(CONCATENATE(AV3,\"'\",\"s\",\" Age\"),$135:$135,0))","v":""},{"$f":"AV5","v":{"$error":"#N/A"}},{"$f":"IF(INDEX($A$135:$W$206,MATCH(A12,$A$135:$A$206,0),MATCH($Q$135,$135:$135,0))>0,0,INDEX($A$135:$W$206,MATCH(A12,$A$135:$A$206,0),MATCH($Q$135,$135:$135,0)))","v":{"$error":"#VALUE!"}},{"$f":"SUM(AV12:AW12)","v":{"$error":"#N/A"}},{"$f":"IF(AX12<=0,0,IF(AU12<INDEX($C$87:$G$88,MATCH($AV$3,$C$87:$C$88,0),5),$AV$6,0))","v":{"$error":"#N/A"}},{"$f":"IF($AV$7=\"\",IF(AU12<INDEX($C$87:$G$88,MATCH($AV$3,$C$87:$C$88,0),5),$L$98,$L$99),IF(AU12<INDEX($C$87:$G$88,MATCH($AV$3,$C$87:$C$88,0),5),$AV$7,$AV$8))","v":0.04},{"$f":"IF(AZ12*SUM(AX12:AY12)<0,0,AZ12*SUM(AX12:AY12))","v":{"$error":"#N/A"}},{"$f":"IF(SUM(AX12:AY12,BA12)<0,0,(SUM(AX12:AY12,BA12)))","v":{"$error":"#N/A"}},null,{"$f":"INDEX($A$135:$C$206,MATCH($A$12,$A$135:$A$206,0),MATCH(CONCATENATE(BE3,\"'\",\"s\",\" Age\"),$135:$135,0))","v":""},{"$f":"BE5","v":{"$error":"#N/A"}},{"$f":"IF(INDEX($A$135:$W$206,MATCH(A12,$A$135:$A$206,0),MATCH($Q$135,$135:$135,0))>0,0,INDEX($A$135:$W$206,MATCH(A12,$A$135:$A$206,0),MATCH($Q$135,$135:$135,0)))","v":{"$error":"#VALUE!"}},{"$f":"SUM(BE12:BF12)","v":{"$error":"#N/A"}},{"$f":"IF(BG12<=0,0,IF(BD12<INDEX($C$87:$G$88,MATCH($BE$3,$C$87:$C$88,0),5),$BE$6,0))","v":{"$error":"#N/A"}},{"$f":"IF($BE$7=\"\",IF(BD12<INDEX($C$87:$G$88,MATCH($BE$3,$C$87:$C$88,0),5),$L$98,$L$99),IF(BD12<INDEX($C$87:$G$88,MATCH($BE$3,$C$87:$C$88,0),5),$BE$7,$BE$8))","v":0.04},{"$f":"IF(BI12*SUM(BG12:BH12)<0,0,BI12*SUM(BG12:BH12))","v":{"$error":"#N/A"}},{"$f":"IF(SUM(BG12:BH12,BJ12)<0,0,(SUM(BG12:BH12,BJ12)))","v":{"$error":"#N/A"}},null,{"$f":"INDEX($A$135:$C$206,MATCH($A$12,$A$135:$A$206,0),MATCH(CONCATENATE(BN3,\"'\",\"s\",\" Age\"),$135:$135,0))","v":""},{"$f":"BN5","v":{"$error":"#N/A"}},{"$f":"IF(INDEX($A$135:$W$206,MATCH(A12,$A$135:$A$206,0),MATCH($Q$135,$135:$135,0))>0,0,INDEX($A$135:$W$206,MATCH(A12,$A$135:$A$206,0),MATCH($Q$135,$135:$135,0)))","v":{"$error":"#VALUE!"}},{"$f":"SUM(BN12:BO12)","v":{"$error":"#N/A"}},{"$f":"IF(BP12<=0,0,IF(BM12<INDEX($C$87:$G$88,MATCH($BN$3,$C$87:$C$88,0),5),$BN$6,0))","v":{"$error":"#N/A"}},{"$f":"IF($BN$7=\"\",IF(BM12<INDEX($C$87:$G$88,MATCH($BN$3,$C$87:$C$88,0),5),$L$98,$L$99),IF(BM12<INDEX($C$87:$G$88,MATCH($BN$3,$C$87:$C$88,0),5),$BN$7,$BN$8))","v":0.04},{"$f":"IF(BR12*SUM(BP12:BQ12)<0,0,BR12*SUM(BP12:BQ12))","v":{"$error":"#N/A"}},{"$f":"IF(SUM(BP12:BQ12,BS12)<0,0,(SUM(BP12:BQ12,BS12)))","v":{"$error":"#N/A"}},null,{"$f":"INDEX($A$135:$C$206,MATCH($A$12,$A$135:$A$206,0),MATCH(CONCATENATE(BW3,\"'\",\"s\",\" Age\"),$135:$135,0))","v":""},{"$f":"BW5","v":{"$error":"#N/A"}},{"$f":"IF(INDEX($A$135:$W$206,MATCH(A12,$A$135:$A$206,0),MATCH($Q$135,$135:$135,0))>0,0,INDEX($A$135:$W$206,MATCH(A12,$A$135:$A$206,0),MATCH($Q$135,$135:$135,0)))","v":{"$error":"#VALUE!"}},{"$f":"SUM(BW12:BX12)","v":{"$error":"#N/A"}},{"$f":"IF(BY12<=0,0,IF(BV12<INDEX($C$87:$G$88,MATCH($BW$3,$C$87:$C$88,0),5),$BW$6,0))","v":{"$error":"#N/A"}},{"$f":"IF($BW$7=\"\",IF(BV12<INDEX($C$87:$G$88,MATCH($BW$3,$C$87:$C$88,0),5),$L$98,$L$99),IF(BV12<INDEX($C$87:$G$88,MATCH($BW$3,$C$87:$C$88,0),5),$BW$7,$BW$8))","v":0.04},{"$f":"IF(CA12*SUM(BY12:BZ12)<0,0,CA12*SUM(BY12:BZ12))","v":{"$error":"#N/A"}},{"$f":"IF(SUM(BY12:BZ12,CB12)<0,0,(SUM(BY12:BZ12,CB12)))","v":{"$error":"#N/A"}},null,{"$f":"INDEX($A$135:$C$206,MATCH($A$12,$A$135:$A$206,0),MATCH(CONCATENATE(CF3,\"'\",\"s\",\" Age\"),$135:$135,0))","v":""},{"$f":"CF5","v":{"$error":"#N/A"}},{"$f":"IF(INDEX($A$135:$W$206,MATCH(A12,$A$135:$A$206,0),MATCH($Q$135,$135:$135,0))>0,0,INDEX($A$135:$W$206,MATCH(A12,$A$135:$A$206,0),MATCH($Q$135,$135:$135,0)))","v":{"$error":"#VALUE!"}},{"$f":"SUM(CF12:CG12)","v":{"$error":"#N/A"}},{"$f":"IF(CH12<=0,0,IF(CE12<INDEX($C$87:$G$88,MATCH($CF$3,$C$87:$C$88,0),5),$CF$6,0))","v":{"$error":"#N/A"}},{"$f":"IF($CF$7=\"\",IF(CE12<INDEX($C$87:$G$88,MATCH($CF$3,$C$87:$C$88,0),5),$L$98,$L$99),IF(CE12<INDEX($C$87:$G$88,MATCH($CF$3,$C$87:$C$88,0),5),$CF$7,$CF$8))","v":0.04},{"$f":"IF(CJ12*SUM(CH12:CI12)<0,0,CJ12*SUM(CH12:CI12))","v":{"$error":"#N/A"}},{"$f":"IF(SUM(CH12:CI12,CK12)<0,0,(SUM(CH12:CI12,CK12)))","v":{"$error":"#N/A"}},null,{"$f":"INDEX($A$135:$C$206,MATCH($A$12,$A$135:$A$206,0),MATCH(CONCATENATE(CO3,\"'\",\"s\",\" Age\"),$135:$135,0))","v":""},{"$f":"CO5","v":{"$error":"#N/A"}},{"$f":"IF(INDEX($A$135:$W$206,MATCH(A12,$A$135:$A$206,0),MATCH($Q$135,$135:$135,0))>0,0,INDEX($A$135:$W$206,MATCH(A12,$A$135:$A$206,0),MATCH($Q$135,$135:$135,0)))","v":{"$error":"#VALUE!"}},{"$f":"SUM(CO12:CP12)","v":{"$error":"#N/A"}},{"$f":"IF(CQ12<=0,0,IF(CN12<INDEX($C$87:$G$88,MATCH($CO$3,$C$87:$C$88,0),5),$CO$6,0))","v":{"$error":"#N/A"}},{"$f":"IF($CO$7=\"\",IF(CN12<INDEX($C$87:$G$88,MATCH($CO$3,$C$87:$C$88,0),5),$L$98,$L$99),IF(CN12<INDEX($C$87:$G$88,MATCH($CO$3,$C$87:$C$88,0),5),$CO$7,$CO$8))","v":0.04},{"$f":"IF(CS12*SUM(CQ12:CR12)<0,0,CS12*SUM(CQ12:CR12))","v":{"$error":"#N/A"}},{"$f":"IF(SUM(CQ12:CR12,CT12)<0,0,(SUM(CQ12:CR12,CT12)))","v":{"$error":"#N/A"}},null,{"$f":"INDEX($A$135:$C$206,MATCH($A$12,$A$135:$A$206,0),MATCH(CONCATENATE(CX3,\"'\",\"s\",\" Age\"),$135:$135,0))","v":""},{"$f":"CX5","v":{"$error":"#N/A"}},{"$f":"IF(INDEX($A$135:$W$206,MATCH(A12,$A$135:$A$206,0),MATCH($Q$135,$135:$135,0))>0,0,INDEX($A$135:$W$206,MATCH(A12,$A$135:$A$206,0),MATCH($Q$135,$135:$135,0)))","v":{"$error":"#VALUE!"}},{"$f":"SUM(CX12:CY12)","v":{"$error":"#N/A"}},{"$f":"IF(CZ12<=0,0,IF(CW12<INDEX($C$87:$G$88,MATCH($CX$3,$C$87:$C$88,0),5),$CX$6,0))","v":{"$error":"#N/A"}},{"$f":"IF($CX$7=\"\",IF(CW12<INDEX($C$87:$G$88,MATCH($CX$3,$C$87:$C$88,0),5),$L$98,$L$99),IF(CW12<INDEX($C$87:$G$88,MATCH($CX$3,$C$87:$C$88,0),5),$C$7,$C$8))","v":0.04},{"$f":"IF(DB12*SUM(CZ12:DA12)<0,0,DB12*SUM(CZ12:DA12))","v":{"$error":"#N/A"}},{"$f":"IF(SUM(CZ12:DA12,DC12)<0,0,(SUM(CZ12:DA12,DC12)))","v":{"$error":"#N/A"}}]
[{"$f":"A12+1","v":2021},{"$f":"B12+1","v":{"$error":"#VALUE!"}},{"$f":"I12","v":{"$error":"#N/A"}},{"$f":"IF(INDEX($A$135:$W$206,MATCH(A13,$A$135:$A$206,0),MATCH($Q$135,$135:$135,0))>0,0,INDEX($A$135:$W$206,MATCH(A13,$A$135:$A$206,0),MATCH($Q$135,$135:$135,0)))","v":{"$error":"#VALUE!"}},{"$error":"#N/A"},{"$error":"#N/A"},{"$error":"#VALUE!"},{"$error":"#VALUE!"},{"$error":"#N/A"},null,{"$f":"K12+1","v":{"$error":"#VALUE!"}},{"$f":"R12","v":{"$error":"#N/A"}},{"$f":"IF(E13<0,E13,0)","v":{"$error":"#N/A"}},{"$error":"#N/A"},{"$error":"#N/A"},{"$error":"#VALUE!"},{"$error":"#VALUE!"},{"$error":"#N/A"},null,{"$f":"T12+1","v":{"$error":"#VALUE!"}},{"$f":"AA12","v":{"$error":"#N/A"}},{"$f":"IF(N13<0,N13,0)","v":{"$error":"#N/A"}},{"$error":"#N/A"},{"$error":"#N/A"},{"$error":"#VALUE!"},{"$error":"#VALUE!"},{"$error":"#N/A"},null,{"$f":"AC12+1","v":{"$error":"#VALUE!"}},{"$f":"AJ12","v":{"$error":"#N/A"}},{"$f":"IF(W13<0,W13,0)","v":{"$error":"#N/A"}},{"$error":"#N/A"},{"$error":"#N/A"},{"$error":"#VALUE!"},{"$error":"#VALUE!"},{"$error":"#N/A"},null,{"$f":"AL12+1","v":{"$error":"#VALUE!"}},{"$f":"AS12","v":{"$error":"#N/A"}},{"$f":"IF(AF13<0,AF13,0)","v":{"$error":"#N/A"}},{"$error":"#N/A"},{"$error":"#N/A"},{"$error":"#VALUE!"},{"$error":"#VALUE!"},{"$error":"#N/A"},null,{"$f":"AU12+1","v":{"$error":"#VALUE!"}},{"$f":"BB12","v":{"$error":"#N/A"}},{"$f":"IF(AO13<0,AO13,0)","v":{"$error":"#N/A"}},{"$error":"#N/A"},{"$error":"#N/A"},{"$error":"#VALUE!"},{"$error":"#VALUE!"},{"$error":"#N/A"},null,{"$f":"BD12+1","v":{"$error":"#VALUE!"}},{"$f":"BK12","v":{"$error":"#N/A"}},{"$f":"IF(AX13<0,AX13,0)","v":{"$error":"#N/A"}},{"$error":"#N/A"},{"$error":"#N/A"},{"$error":"#VALUE!"},{"$error":"#VALUE!"},{"$error":"#N/A"},null,{"$f":"BM12+1","v":{"$error":"#VALUE!"}},{"$f":"BT12","v":{"$error":"#N/A"}},{"$f":"IF(BG13<0,BG13,0)","v":{"$error":"#N/A"}},{"$error":"#N/A"},{"$error":"#N/A"},{"$error":"#VALUE!"},{"$error":"#VALUE!"},{"$error":"#N/A"},null,{"$f":"BV12+1","v":{"$error":"#VALUE!"}},{"$f":"CC12","v":{"$error":"#N/A"}},{"$f":"IF(BP13<0,BP13,0)","v":{"$error":"#N/A"}},{"$error":"#N/A"},{"$error":"#N/A"},{"$error":"#VALUE!"},{"$error":"#VALUE!"},{"$error":"#N/A"},null,{"$f":"CE12+1","v":{"$error":"#VALUE!"}},{"$f":"CL12","v":{"$error":"#N/A"}},{"$f":"IF(BY13<0,BY13,0)","v":{"$error":"#N/A"}},{"$error":"#N/A"},{"$error":"#N/A"},{"$error":"#VALUE!"},{"$error":"#VALUE!"},{"$error":"#N/A"},null,{"$f":"CN12+1","v":{"$error":"#VALUE!"}},{"$f":"CU12","v":{"$error":"#N/A"}},{"$f":"IF(CH13<0,CH13,0)","v":{"$error":"#N/A"}},{"$error":"#N/A"},{"$error":"#N/A"},{"$f":"IF($CO$7=\"\",IF(CN13<INDEX($C$87:$G$88,MATCH($C$3,$C$87:$C$88,0),5),$L$98,$L$99),IF(CN13<INDEX($C$87:$G$88,MATCH($C$3,$C$87:$C$88,0),5),$C$7,$C$8))","v":{"$error":"#VALUE!"}},{"$error":"#VALUE!"},{"$error":"#N/A"},null,{"$f":"CW12+1","v":{"$error":"#VALUE!"}},{"$f":"DD12","v":{"$error":"#N/A"}},{"$f":"IF(CQ13<0,CQ13,0)","v":{"$error":"#N/A"}},{"$error":"#N/A"},{"$error":"#N/A"},{"$error":"#VALUE!"},{"$error":"#VALUE!"},{"$error":"#N/A"}]
[{"$f":"A13+1","v":2022},{"$error":"#VALUE!"},{"$error":"#N/A"},{"$error":"#VALUE!"},{"$f":"SUM(C14:D14)","v":{"$error":"#N/A"}},{"$error":"#N/A"},{"$error":"#VALUE!"},{"$error":"#VALUE!"},{"$error":"#N/A"},null,{"$f":"K13+1","v":{"$error":"#VALUE!"}},{"$error":"#N/A"},{"$error":"#N/A"},{"$error":"#N/A"},{"$error":"#N/A"},{"$error":"#VALUE!"},{"$error":"#VALUE!"},{"$error":"#N/A"},null,{"$f":"T13+1","v":{"$error":"#VALUE!"}},{"$error":"#N/A"},{"$error":"#N/A"},{"$error":"#N/A"},{"$error":"#N/A"},{"$error":"#VALUE!"},{"$error":"#VALUE!"},{"$error":"#N/A"},null,{"$f":"AC13+1","v":{"$error":"#VALUE!"}},{"$error":"#N/A"},{"$error":"#N/A"},{"$error":"#N/A"},{"$error":"#N/A"},{"$error":"#VALUE!"},{"$error":"#VALUE!"},{"$error":"#N/A"},null,{"$f":"AL13+1","v":{"$error":"#VALUE!"}},{"$error":"#N/A"},{"$error":"#N/A"},{"$error":"#N/A"},{"$error":"#N/A"},{"$error":"#VALUE!"},{"$error":"#VALUE!"},{"$error":"#N/A"},null,{"$f":"AU13+1","v":{"$error":"#VALUE!"}},{"$error":"#N/A"},{"$error":"#N/A"},{"$error":"#N/A"},{"$error":"#N/A"},{"$error":"#VALUE!"},{"$error":"#VALUE!"},{"$error":"#N/A"},null,{"$f":"BD13+1","v":{"$error":"#VALUE!"}},{"$error":"#N/A"},{"$error":"#N/A"},{"$error":"#N/A"},{"$error":"#N/A"},{"$error":"#VALUE!"},{"$error":"#VALUE!"},{"$error":"#N/A"},null,{"$f":"BM13+1","v":{"$error":"#VALUE!"}},{"$error":"#N/A"},{"$error":"#N/A"},{"$error":"#N/A"},{"$error":"#N/A"},{"$error":"#VALUE!"},{"$error":"#VALUE!"},{"$error":"#N/A"},null,{"$f":"BV13+1","v":{"$error":"#VALUE!"}},{"$error":"#N/A"},{"$error":"#N/A"},{"$error":"#N/A"},{"$error":"#N/A"},{"$error":"#VALUE!"},{"$error":"#VALUE!"},{"$error":"#N/A"},null,{"$f":"CE13+1","v":{"$error":"#VALUE!"}},{"$error":"#N/A"},{"$error":"#N/A"},{"$error":"#N/A"},{"$error":"#N/A"},{"$error":"#VALUE!"},{"$error":"#VALUE!"},{"$error":"#N/A"},null,{"$f":"CN13+1","v":{"$error":"#VALUE!"}},{"$error":"#N/A"},{"$error":"#N/A"},{"$error":"#N/A"},{"$error":"#N/A"},{"$error":"#VALUE!"},{"$error":"#VALUE!"},{"$error":"#N/A"},null,{"$f":"CW13+1","v":{"$error":"#VALUE!"}},{"$error":"#N/A"},{"$error":"#N/A"},{"$error":"#N/A"},{"$error":"#N/A"},{"$error":"#VALUE!"},{"$error":"#VALUE!"},{"$error":"#N/A"}]
[2023,{"$error":"#VALUE!"},{"$error":"#N/A"},{"$error":"#VALUE!"},{"$f":"SUM(C15:D15)","v":{"$error":"#N/A"}},{"$error":"#N/A"},{"$error":"#VALUE!"},{"$f":"IF(G15*SUM(E15:F15)<0,0,G15*SUM(E15:F15))","v":{"$error":"#VALUE!"}},{"$f":"IF(SUM(E15:F15,H15)<0,0,SUM(E15:F15,H15))","v":{"$error":"#N/A"}},null,{"$error":"#VALUE!"},{"$error":"#N/A"},{"$f":"IF(E15<0,E15,0)","v":{"$error":"#N/A"}},{"$f":"SUM(L15:M15)","v":{"$error":"#N/A"}},{"$error":"#N/A"},{"$error":"#VALUE!"},{"$error":"#VALUE!"},{"$f":"IF(SUM(N15:O15,Q15)<0,0,(SUM(N15:O15,Q15)))","v":{"$error":"#N/A"}},null,{"$error":"#VALUE!"},{"$error":"#N/A"},{"$error":"#N/A"},{"$f":"SUM(U15:V15)","v":{"$error":"#N/A"}},{"$error":"#N/A"},{"$error":"#VALUE!"},{"$error":"#VALUE!"},{"$f":"IF(SUM(W15:X15,Z15)<0,0,(SUM(W15:X15,Z15)))","v":{"$error":"#N/A"}},null,{"$error":"#VALUE!"},{"$error":"#N/A"},{"$error":"#N/A"},{"$f":"SUM(AD15:AE15)","v":{"$error":"#N/A"}},{"$error":"#N/A"},{"$error":"#VALUE!"},{"$error":"#VALUE!"},{"$f":"IF(SUM(AF15:AG15,AI15)<0,0,(SUM(AF15:AG15,AI15)))","v":{"$error":"#N/A"}},null,{"$error":"#VALUE!"},{"$error":"#N/A"},{"$error":"#N/A"},{"$f":"SUM(AM15:AN15)","v":{"$error":"#N/A"}},{"$error":"#N/A"},{"$error":"#VALUE!"},{"$error":"#VALUE!"},{"$f":"IF(SUM(AO15:AP15,AR15)<0,0,(SUM(AO15:AP15,AR15)))","v":{"$error":"#N/A"}},null,{"$error":"#VALUE!"},{"$error":"#N/A"},{"$error":"#N/A"},{"$f":"SUM(AV15:AW15)","v":{"$error":"#N/A"}},{"$error":"#N/A"},{"$error":"#VALUE!"},{"$error":"#VALUE!"},{"$f":"IF(SUM(AX15:AY15,BA15)<0,0,(SUM(AX15:AY15,BA15)))","v":{"$error":"#N/A"}},null,{"$error":"#VALUE!"},{"$error":"#N/A"},{"$error":"#N/A"},{"$f":"SUM(BE15:BF15)","v":{"$error":"#N/A"}},{"$error":"#N/A"},{"$error":"#VALUE!"},{"$error":"#VALUE!"},{"$f":"IF(SUM(BG15:BH15,BJ15)<0,0,(SUM(BG15:BH15,BJ15)))","v":{"$error":"#N/A"}},null,{"$error":"#VALUE!"},{"$error":"#N/A"},{"$error":"#N/A"},{"$f":"SUM(BN15:BO15)","v":{"$error":"#N/A"}},{"$error":"#N/A"},{"$error":"#VALUE!"},{"$error":"#VALUE!"},{"$f":"IF(SUM(BP15:BQ15,BS15)<0,0,(SUM(BP15:BQ15,BS15)))","v":{"$error":"#N/A"}},null,{"$error":"#VALUE!"},{"$error":"#N/A"},{"$error":"#N/A"},{"$f":"SUM(BW15:BX15)","v":{"$error":"#N/A"}},{"$error":"#N/A"},{"$error":"#VALUE!"},{"$error":"#VALUE!"},{"$f":"IF(SUM(BY15:BZ15,CB15)<0,0,(SUM(BY15:BZ15,CB15)))","v":{"$error":"#N/A"}},null,{"$error":"#VALUE!"},{"$error":"#N/A"},{"$error":"#N/A"},{"$f":"SUM(CF15:CG15)","v":{"$error":"#N/A"}},{"$error":"#N/A"},{"$error":"#VALUE!"},{"$error":"#VALUE!"},{"$f":"IF(SUM(CH15:CI15,CK15)<0,0,(SUM(CH15:CI15,CK15)))","v":{"$error":"#N/A"}},null,{"$error":"#VALUE!"},{"$error":"#N/A"},{"$error":"#N/A"},{"$f":"SUM(CO15:CP15)","v":{"$error":"#N/A"}},{"$error":"#N/A"},{"$error":"#VALUE!"},{"$error":"#VALUE!"},{"$f":"IF(SUM(CQ15:CR15,CT15)<0,0,(SUM(CQ15:CR15,CT15)))","v":{"$error":"#N/A"}},null,{"$error":"#VALUE!"},{"$error":"#N/A"},{"$error":"#N/A"},{"$f":"SUM(CX15:CY15)","v":{"$error":"#N/A"}},{"$error":"#N/A"},{"$error":"#VALUE!"},{"$error":"#VALUE!"},{"$f":"IF(SUM(CZ15:DA15,DC15)<0,0,(SUM(CZ15:DA15,DC15)))","v":{"$error":"#N/A"}}]
[2024,{"$error":"#VALUE!"},{"$error":"#N/A"},{"$error":"#VALUE!"},{"$error":"#N/A"},{"$error":"#N/A"},{"$error":"#VALUE!"},{"$f":"IF(G16*SUM(E16:F16)<0,0,G16*SUM(E16:F16))","v":{"$error":"#VALUE!"}},{"$f":"IF(SUM(E16:F16,H16)<0,0,SUM(E16:F16,H16))","v":{"$error":"#N/A"}},null,{"$error":"#VALUE!"},{"$error":"#N/A"},{"$f":"IF(E16<0,E16,0)","v":{"$error":"#N/A"}},{"$f":"SUM(L16:M16)","v":{"$error":"#N/A"}},{"$error":"#N/A"},{"$error":"#VALUE!"},{"$f":"IF(P16*SUM(N16:O16)<0,0,P16*SUM(N16:O16))","v":{"$error":"#VALUE!"}},{"$f":"IF(SUM(N16:O16,Q16)<0,0,(SUM(N16:O16,Q16)))","v":{"$error":"#N/A"}},null,{"$error":"#VALUE!"},{"$error":"#N/A"},{"$error":"#N/A"},{"$f":"SUM(U16:V16)","v":{"$error":"#N/A"}},{"$error":"#N/A"},{"$error":"#VALUE!"},{"$f":"IF(Y16*SUM(W16:X16)<0,0,Y16*SUM(W16:X16))","v":{"$error":"#VALUE!"}},{"$f":"IF(SUM(W16:X16,Z16)<0,0,(SUM(W16:X16,Z16)))","v":{"$error":"#N/A"}},null,{"$error":"#VALUE!"},{"$error":"#N/A"},{"$error":"#N/A"},{"$f":"SUM(AD16:AE16)","v":{"$error":"#N/A"}},{"$error":"#N/A"},{"$error":"#VALUE!"},{"$f":"IF(AH16*SUM(AF16:AG16)<0,0,AH16*SUM(AF16:AG16))","v":{"$error":"#VALUE!"}},{"$f":"IF(SUM(AF16:AG16,AI16)<0,0,(SUM(AF16:AG16,AI16)))","v":{"$error":"#N/A"}},null,{"$error":"#VALUE!"},{"$error":"#N/A"},{"$error":"#N/A"},{"$f":"SUM(AM16:AN16)","v":{"$error":"#N/A"}},{"$error":"#N/A"},{"$error":"#VALUE!"},{"$f":"IF(AQ16*SUM(AO16:AP16)<0,0,AQ16*SUM(AO16:AP16))","v":{"$error":"#VALUE!"}},{"$f":"IF(SUM(AO16:AP16,AR16)<0,0,(SUM(AO16:AP16,AR16)))","v":{"$error":"#N/A"}},null,{"$error":"#VALUE!"},{"$error":"#N/A"},{"$error":"#N/A"},{"$f":"SUM(AV16:AW16)","v":{"$error":"#N/A"}},{"$error":"#N/A"},{"$error":"#VALUE!"},{"$f":"IF(AZ16*SUM(AX16:AY16)<0,0,AZ16*SUM(AX16:AY16))","v":{"$error":"#VALUE!"}},{"$f":"IF(SUM(AX16:AY16,BA16)<0,0,(SUM(AX16:AY16,BA16)))","v":{"$error":"#N/A"}},null,{"$error":"#VALUE!"},{"$error":"#N/A"},{"$error":"#N/A"},{"$f":"SUM(BE16:BF16)","v":{"$error":"#N/A"}},{"$error":"#N/A"},{"$error":"#VALUE!"},{"$f":"IF(BI16*SUM(BG16:BH16)<0,0,BI16*SUM(BG16:BH16))","v":{"$error":"#VALUE!"}},{"$f":"IF(SUM(BG16:BH16,BJ16)<0,0,(SUM(BG16:BH16,BJ16)))","v":{"$error":"#N/A"}},null,{"$error":"#VALUE!"},{"$error":"#N/A"},{"$error":"#N/A"},{"$f":"SUM(BN16:BO16)","v":{"$error":"#N/A"}},{"$error":"#N/A"},{"$error":"#VALUE!"},{"$f":"IF(BR16*SUM(BP16:BQ16)<0,0,BR16*SUM(BP16:BQ16))","v":{"$error":"#VALUE!"}},{"$f":"IF(SUM(BP16:BQ16,BS16)<0,0,(SUM(BP16:BQ16,BS16)))","v":{"$error":"#N/A"}},null,{"$error":"#VALUE!"},{"$error":"#N/A"},{"$error":"#N/A"},{"$f":"SUM(BW16:BX16)","v":{"$error":"#N/A"}},{"$error":"#N/A"},{"$error":"#VALUE!"},{"$f":"IF(CA16*SUM(BY16:BZ16)<0,0,CA16*SUM(BY16:BZ16))","v":{"$error":"#VALUE!"}},{"$f":"IF(SUM(BY16:BZ16,CB16)<0,0,(SUM(BY16:BZ16,CB16)))","v":{"$error":"#N/A"}},null,{"$error":"#VALUE!"},{"$error":"#N/A"},{"$error":"#N/A"},{"$f":"SUM(CF16:CG16)","v":{"$error":"#N/A"}},{"$error":"#N/A"},{"$error":"#VALUE!"},{"$f":"IF(CJ16*SUM(CH16:CI16)<0,0,CJ16*SUM(CH16:CI16))","v":{"$error":"#VALUE!"}},{"$f":"IF(SUM(CH16:CI16,CK16)<0,0,(SUM(CH16:CI16,CK16)))","v":{"$error":"#N/A"}},null,{"$error":"#VALUE!"},{"$error":"#N/A"},{"$error":"#N/A"},{"$f":"SUM(CO16:CP16)","v":{"$error":"#N/A"}},{"$error":"#N/A"},{"$error":"#VALUE!"},{"$f":"IF(CS16*SUM(CQ16:CR16)<0,0,CS16*SUM(CQ16:CR16))","v":{"$error":"#VALUE!"}},{"$f":"IF(SUM(CQ16:CR16,CT16)<0,0,(SUM(CQ16:CR16,CT16)))","v":{"$error":"#N/A"}},null,{"$error":"#VALUE!"},{"$error":"#N/A"},{"$error":"#N/A"},{"$f":"SUM(CX16:CY16)","v":{"$error":"#N/A"}},{"$error":"#N/A"},{"$error":"#VALUE!"},{"$f":"IF(DB16*SUM(CZ16:DA16)<0,0,DB16*SUM(CZ16:DA16))","v":{"$error":"#VALUE!"}},{"$f":"IF(SUM(CZ16:DA16,DC16)<0,0,(SUM(CZ16:DA16,DC16)))","v":{"$error":"#N/A"}}]
[2025,{"$error":"#VALUE!"},{"$error":"#N/A"},{"$error":"#VALUE!"},{"$error":"#N/A"},{"$error":"#N/A"},{"$error":"#VALUE!"},{"$error":"#VALUE!"},{"$error":"#N/A"},null,{"$error":"#VALUE!"},{"$error":"#N/A"},{"$error":"#N/A"},{"$error":"#N/A"},{"$error":"#N/A"},{"$error":"#VALUE!"},{"$f":"IF(P17*SUM(N17:O17)<0,0,P17*SUM(N17:O17))","v":{"$error":"#VALUE!"}},{"$error":"#N/A"},null,{"$error":"#VALUE!"},{"$error":"#N/A"},{"$error":"#N/A"},{"$error":"#N/A"},{"$error":"#N/A"},{"$error":"#VALUE!"},{"$f":"IF(Y17*SUM(W17:X17)<0,0,Y17*SUM(W17:X17))","v":{"$error":"#VALUE!"}},{"$error":"#N/A"},null,{"$error":"#VALUE!"},{"$error":"#N/A"},{"$error":"#N/A"},{"$error":"#N/A"},{"$error":"#N/A"},{"$error":"#VALUE!"},{"$f":"IF(AH17*SUM(AF17:AG17)<0,0,AH17*SUM(AF17:AG17))","v":{"$error":"#VALUE!"}},{"$error":"#N/A"},null,{"$error":"#VALUE!"},{"$error":"#N/A"},{"$error":"#N/A"},{"$error":"#N/A"},{"$error":"#N/A"},{"$error":"#VALUE!"},{"$f":"IF(AQ17*SUM(AO17:AP17)<0,0,AQ17*SUM(AO17:AP17))","v":{"$error":"#VALUE!"}},{"$error":"#N/A"},null,{"$error":"#VALUE!"},{"$error":"#N/A"},{"$error":"#N/A"},{"$error":"#N/A"},{"$error":"#N/A"},{"$error":"#VALUE!"},{"$f":"IF(AZ17*SUM(AX17:AY17)<0,0,AZ17*SUM(AX17:AY17))","v":{"$error":"#VALUE!"}},{"$error":"#N/A"},null,{"$error":"#VALUE!"},{"$error":"#N/A"},{"$error":"#N/A"},{"$error":"#N/A"},{"$error":"#N/A"},{"$error":"#VALUE!"},{"$f":"IF(BI17*SUM(BG17:BH17)<0,0,BI17*SUM(BG17:BH17))","v":{"$error":"#VALUE!"}},{"$error":"#N/A"},null,{"$error":"#VALUE!"},{"$error":"#N/A"},{"$error":"#N/A"},{"$error":"#N/A"},{"$error":"#N/A"},{"$error":"#VALUE!"},{"$f":"IF(BR17*SUM(BP17:BQ17)<0,0,BR17*SUM(BP17:BQ17))","v":{"$error":"#VALUE!"}},{"$error":"#N/A"},null,{"$error":"#VALUE!"},{"$error":"#N/A"},{"$error":"#N/A"},{"$error":"#N/A"},{"$error":"#N/A"},{"$error":"#VALUE!"},{"$f":"IF(CA17*SUM(BY17:BZ17)<0,0,CA17*SUM(BY17:BZ17))","v":{"$error":"#VALUE!"}},{"$error":"#N/A"},null,{"$error":"#VALUE!"},{"$error":"#N/A"},{"$error":"#N/A"},{"$error":"#N/A"},{"$error":"#N/A"},{"$error":"#VALUE!"},{"$f":"IF(CJ17*SUM(CH17:CI17)<0,0,CJ17*SUM(CH17:CI17))","v":{"$error":"#VALUE!"}},{"$error":"#N/A"},null,{"$error":"#VALUE!"},{"$error":"#N/A"},{"$error":"#N/A"},{"$error":"#N/A"},{"$error":"#N/A"},{"$error":"#VALUE!"},{"$f":"IF(CS17*SUM(CQ17:CR17)<0,0,CS17*SUM(CQ17:CR17))","v":{"$error":"#VALUE!"}},{"$error":"#N/A"},null,{"$error":"#VALUE!"},{"$error":"#N/A"},{"$error":"#N/A"},{"$error":"#N/A"},{"$error":"#N/A"},{"$error":"#VALUE!"},{"$f":"IF(DB17*SUM(CZ17:DA17)<0,0,DB17*SUM(CZ17:DA17))","v":{"$error":"#VALUE!"}},{"$error":"#N/A"}]
[2026,{"$error":"#VALUE!"},{"$error":"#N/A"},{"$error":"#VALUE!"},{"$error":"#N/A"},{"$error":"#N/A"},{"$error":"#VALUE!"},{"$error":"#VALUE!"},{"$error":"#N/A"},null,{"$error":"#VALUE!"},{"$error":"#N/A"},{"$error":"#N/A"},{"$error":"#N/A"},{"$error":"#N/A"},{"$error":"#VALUE!"},{"$error":"#VALUE!"},{"$error":"#N/A"},null,{"$error":"#VALUE!"},{"$error":"#N/A"},{"$error":"#N/A"},{"$error":"#N/A"},{"$error":"#N/A"},{"$error":"#VALUE!"},{"$error":"#VALUE!"},{"$error":"#N/A"},null,{"$error":"#VALUE!"},{"$error":"#N/A"},{"$error":"#N/A"},{"$error":"#N/A"},{"$error":"#N/A"},{"$error":"#VALUE!"},{"$error":"#VALUE!"},{"$error":"#N/A"},null,{"$error":"#VALUE!"},{"$error":"#N/A"},{"$error":"#N/A"},{"$error":"#N/A"},{"$error":"#N/A"},{"$error":"#VALUE!"},{"$error":"#VALUE!"},{"$error":"#N/A"},null,{"$error":"#VALUE!"},{"$error":"#N/A"},{"$error":"#N/A"},{"$error":"#N/A"},{"$error":"#N/A"},{"$error":"#VALUE!"},{"$error":"#VALUE!"},{"$error":"#N/A"},null,{"$error":"#VALUE!"},{"$error":"#N/A"},{"$error":"#N/A"},{"$error":"#N/A"},{"$error":"#N/A"},{"$error":"#VALUE!"},{"$error":"#VALUE!"},{"$error":"#N/A"},null,{"$error":"#VALUE!"},{"$error":"#N/A"},{"$error":"#N/A"},{"$error":"#N/A"},{"$error":"#N/A"},{"$error":"#VALUE!"},{"$error":"#VALUE!"},{"$error":"#N/A"},null,{"$error":"#VALUE!"},{"$error":"#N/A"},{"$error":"#N/A"},{"$error":"#N/A"},{"$error":"#N/A"},{"$error":"#VALUE!"},{"$error":"#VALUE!"},{"$error":"#N/A"},null,{"$error":"#VALUE!"},{"$error":"#N/A"},{"$error":"#N/A"},{"$error":"#N/A"},{"$error":"#N/A"},{"$error":"#VALUE!"},{"$error":"#VALUE!"},{"$error":"#N/A"},null,{"$error":"#VALUE!"},{"$error":"#N/A"},{"$error":"#N/A"},{"$error":"#N/A"},{"$error":"#N/A"},{"$error":"#VALUE!"},{"$error":"#VALUE!"},{"$error":"#N/A"},null,{"$error":"#VALUE!"},{"$error":"#N/A"},{"$error":"#N/A"},{"$error":"#N/A"},{"$error":"#N/A"},{"$error":"#VALUE!"},{"$error":"#VALUE!"},{"$error":"#N/A"}]
[2027,{"$error":"#VALUE!"},{"$error":"#N/A"},{"$error":"#VALUE!"},{"$error":"#N/A"},{"$error":"#N/A"},{"$error":"#VALUE!"},{"$error":"#VALUE!"},{"$error":"#N/A"},null,{"$error":"#VALUE!"},{"$error":"#N/A"},{"$error":"#N/A"},{"$error":"#N/A"},{"$error":"#N/A"},{"$error":"#VALUE!"},{"$error":"#VALUE!"},{"$error":"#N/A"},null,{"$error":"#VALUE!"},{"$error":"#N/A"},{"$error":"#N/A"},{"$error":"#N/A"},{"$error":"#N/A"},{"$error":"#VALUE!"},{"$error":"#VALUE!"},{"$error":"#N/A"},null,{"$error":"#VALUE!"},{"$error":"#N/A"},{"$error":"#N/A"},{"$error":"#N/A"},{"$error":"#N/A"},{"$error":"#VALUE!"},{"$error":"#VALUE!"},{"$error":"#N/A"},null,{"$error":"#VALUE!"},{"$error":"#N/A"},{"$error":"#N/A"},{"$error":"#N/A"},{"$error":"#N/A"},{"$error":"#VALUE!"},{"$error":"#VALUE!"},{"$error":"#N/A"},null,{"$error":"#VALUE!"},{"$error":"#N/A"},{"$error":"#N/A"},{"$error":"#N/A"},{"$error":"#N/A"},{"$error":"#VALUE!"},{"$error":"#VALUE!"},{"$error":"#N/A"},null,{"$error":"#VALUE!"},{"$error":"#N/A"},{"$error":"#N/A"},{"$error":"#N/A"},{"$error":"#N/A"},{"$error":"#VALUE!"},{"$error":"#VALUE!"},{"$error":"#N/A"},null,{"$error":"#VALUE!"},{"$error":"#N/A"},{"$error":"#N/A"},{"$error":"#N/A"},{"$error":"#N/A"},{"$error":"#VALUE!"},{"$error":"#VALUE!"},{"$error":"#N/A"},null,{"$error":"#VALUE!"},{"$error":"#N/A"},{"$error":"#N/A"},{"$error":"#N/A"},{"$error":"#N/A"},{"$error":"#VALUE!"},{"$error":"#VALUE!"},{"$error":"#N/A"},null,{"$error":"#VALUE!"},{"$error":"#N/A"},{"$error":"#N/A"},{"$error":"#N/A"},{"$error":"#N/A"},{"$error":"#VALUE!"},{"$error":"#VALUE!"},{"$error":"#N/A"},null,{"$error":"#VALUE!"},{"$error":"#N/A"},{"$error":"#N/A"},{"$error":"#N/A"},{"$error":"#N/A"},{"$error":"#VALUE!"},{"$error":"#VALUE!"},{"$error":"#N/A"},null,{"$error":"#VALUE!"},{"$error":"#N/A"},{"$error":"#N/A"},{"$error":"#N/A"},{"$error":"#N/A"},{"$error":"#VALUE!"},{"$error":"#VALUE!"},{"$error":"#N/A"}]
[2028,{"$error":"#VALUE!"},{"$error":"#N/A"},{"$error":"#VALUE!"},{"$error":"#N/A"},{"$error":"#N/A"},{"$error":"#VALUE!"},{"$error":"#VALUE!"},{"$error":"#N/A"},null,{"$error":"#VALUE!"},{"$error":"#N/A"},{"$error":"#N/A"},{"$error":"#N/A"},{"$error":"#N/A"},{"$error":"#VALUE!"},{"$error":"#VALUE!"},{"$error":"#N/A"},null,{"$error":"#VALUE!"},{"$error":"#N/A"},{"$error":"#N/A"},{"$error":"#N/A"},{"$error":"#N/A"},{"$error":"#VALUE!"},{"$error":"#VALUE!"},{"$error":"#N/A"},null,{"$error":"#VALUE!"},{"$error":"#N/A"},{"$error":"#N/A"},{"$error":"#N/A"},{"$error":"#N/A"},{"$error":"#VALUE!"},{"$error":"#VALUE!"},{"$error":"#N/A"},null,{"$error":"#VALUE!"},{"$error":"#N/A"},{"$error":"#N/A"},{"$error":"#N/A"},{"$error":"#N/A"},{"$error":"#VALUE!"},{"$error":"#VALUE!"},{"$error":"#N/A"},null,{"$error":"#VALUE!"},{"$error":"#N/A"},{"$error":"#N/A"},{"$error":"#N/A"},{"$error":"#N/A"},{"$error":"#VALUE!"},{"$error":"#VALUE!"},{"$error":"#N/A"},null,{"$error":"#VALUE!"},{"$error":"#N/A"},{"$error":"#N/A"},{"$error":"#N/A"},{"$error":"#N/A"},{"$error":"#VALUE!"},{"$error":"#VALUE!"},{"$error":"#N/A"},null,{"$error":"#VALUE!"},{"$error":"#N/A"},{"$error":"#N/A"},{"$error":"#N/A"},{"$error":"#N/A"},{"$error":"#VALUE!"},{"$error":"#VALUE!"},{"$error":"#N/A"},null,{"$error":"#VALUE!"},{"$error":"#N/A"},{"$error":"#N/A"},{"$error":"#N/A"},{"$error":"#N/A"},{"$error":"#VALUE!"},{"$error":"#VALUE!"},{"$error":"#N/A"},null,{"$error":"#VALUE!"},{"$error":"#N/A"},{"$error":"#N/A"},{"$error":"#N/A"},{"$error":"#N/A"},{"$error":"#VALUE!"},{"$error":"#VALUE!"},{"$error":"#N/A"},null,{"$error":"#VALUE!"},{"$error":"#N/A"},{"$error":"#N/A"},{"$error":"#N/A"},{"$error":"#N/A"},{"$error":"#VALUE!"},{"$error":"#VALUE!"},{"$error":"#N/A"},null,{"$error":"#VALUE!"},{"$error":"#N/A"},{"$error":"#N/A"},{"$error":"#N/A"},{"$error":"#N/A"},{"$error":"#VALUE!"},{"$error":"#VALUE!"},{"$error":"#N/A"}]
[2029,{"$error":"#VALUE!"},{"$error":"#N/A"},{"$error":"#VALUE!"},{"$error":"#N/A"},{"$error":"#N/A"},{"$error":"#VALUE!"},{"$error":"#VALUE!"},{"$error":"#N/A"},null,{"$error":"#VALUE!"},{"$error":"#N/A"},{"$error":"#N/A"},{"$error":"#N/A"},{"$error":"#N/A"},{"$error":"#VALUE!"},{"$error":"#VALUE!"},{"$error":"#N/A"},null,{"$error":"#VALUE!"},{"$error":"#N/A"},{"$error":"#N/A"},{"$error":"#N/A"},{"$error":"#N/A"},{"$error":"#VALUE!"},{"$error":"#VALUE!"},{"$error":"#N/A"},null,{"$error":"#VALUE!"},{"$error":"#N/A"},{"$error":"#N/A"},{"$error":"#N/A"},{"$error":"#N/A"},{"$error":"#VALUE!"},{"$error":"#VALUE!"},{"$error":"#N/A"},null,{"$error":"#VALUE!"},{"$error":"#N/A"},{"$error":"#N/A"},{"$error":"#N/A"},{"$error":"#N/A"},{"$error":"#VALUE!"},{"$error":"#VALUE!"},{"$error":"#N/A"},null,{"$error":"#VALUE!"},{"$error":"#N/A"},{"$error":"#N/A"},{"$error":"#N/A"},{"$error":"#N/A"},{"$error":"#VALUE!"},{"$error":"#VALUE!"},{"$error":"#N/A"},null,{"$error":"#VALUE!"},{"$error":"#N/A"},{"$error":"#N/A"},{"$error":"#N/A"},{"$error":"#N/A"},{"$error":"#VALUE!"},{"$error":"#VALUE!"},{"$error":"#N/A"},null,{"$error":"#VALUE!"},{"$error":"#N/A"},{"$error":"#N/A"},{"$error":"#N/A"},{"$error":"#N/A"},{"$error":"#VALUE!"},{"$error":"#VALUE!"},{"$error":"#N/A"},null,{"$error":"#VALUE!"},{"$error":"#N/A"},{"$error":"#N/A"},{"$error":"#N/A"},{"$error":"#N/A"},{"$error":"#VALUE!"},{"$error":"#VALUE!"},{"$error":"#N/A"},null,{"$error":"#VALUE!"},{"$error":"#N/A"},{"$error":"#N/A"},{"$error":"#N/A"},{"$error":"#N/A"},{"$error":"#VALUE!"},{"$error":"#VALUE!"},{"$error":"#N/A"},null,{"$error":"#VALUE!"},{"$error":"#N/A"},{"$error":"#N/A"},{"$error":"#N/A"},{"$error":"#N/A"},{"$error":"#VALUE!"},{"$error":"#VALUE!"},{"$error":"#N/A"},null,{"$error":"#VALUE!"},{"$error":"#N/A"},{"$error":"#N/A"},{"$error":"#N/A"},{"$error":"#N/A"},{"$error":"#VALUE!"},{"$error":"#VALUE!"},{"$error":"#N/A"}]
[2030,{"$error":"#VALUE!"},{"$error":"#N/A"},{"$error":"#VALUE!"},{"$error":"#N/A"},{"$error":"#N/A"},{"$error":"#VALUE!"},{"$error":"#VALUE!"},{"$error":"#N/A"},null,{"$error":"#VALUE!"},{"$error":"#N/A"},{"$error":"#N/A"},{"$error":"#N/A"},{"$error":"#N/A"},{"$error":"#VALUE!"},{"$error":"#VALUE!"},{"$error":"#N/A"},null,{"$error":"#VALUE!"},{"$error":"#N/A"},{"$error":"#N/A"},{"$error":"#N/A"},{"$error":"#N/A"},{"$error":"#VALUE!"},{"$error":"#VALUE!"},{"$error":"#N/A"},null,{"$error":"#VALUE!"},{"$error":"#N/A"},{"$error":"#N/A"},{"$error":"#N/A"},{"$error":"#N/A"},{"$error":"#VALUE!"},{"$error":"#VALUE!"},{"$error":"#N/A"},null,{"$error":"#VALUE!"},{"$error":"#N/A"},{"$error":"#N/A"},{"$error":"#N/A"},{"$error":"#N/A"},{"$error":"#VALUE!"},{"$error":"#VALUE!"},{"$error":"#N/A"},null,{"$error":"#VALUE!"},{"$error":"#N/A"},{"$error":"#N/A"},{"$error":"#N/A"},{"$error":"#N/A"},{"$error":"#VALUE!"},{"$error":"#VALUE!"},{"$error":"#N/A"},null,{"$error":"#VALUE!"},{"$error":"#N/A"},{"$error":"#N/A"},{"$error":"#N/A"},{"$error":"#N/A"},{"$error":"#VALUE!"},{"$error":"#VALUE!"},{"$error":"#N/A"},null,{"$error":"#VALUE!"},{"$error":"#N/A"},{"$error":"#N/A"},{"$error":"#N/A"},{"$error":"#N/A"},{"$error":"#VALUE!"},{"$error":"#VALUE!"},{"$error":"#N/A"},null,{"$error":"#VALUE!"},{"$error":"#N/A"},{"$error":"#N/A"},{"$error":"#N/A"},{"$error":"#N/A"},{"$error":"#VALUE!"},{"$error":"#VALUE!"},{"$error":"#N/A"},null,{"$error":"#VALUE!"},{"$error":"#N/A"},{"$error":"#N/A"},{"$error":"#N/A"},{"$error":"#N/A"},{"$error":"#VALUE!"},{"$error":"#VALUE!"},{"$error":"#N/A"},null,{"$error":"#VALUE!"},{"$error":"#N/A"},{"$error":"#N/A"},{"$error":"#N/A"},{"$error":"#N/A"},{"$error":"#VALUE!"},{"$error":"#VALUE!"},{"$error":"#N/A"},null,{"$error":"#VALUE!"},{"$error":"#N/A"},{"$error":"#N/A"},{"$error":"#N/A"},{"$error":"#N/A"},{"$error":"#VALUE!"},{"$error":"#VALUE!"},{"$error":"#N/A"}]
[2031,{"$error":"#VALUE!"},{"$error":"#N/A"},{"$error":"#VALUE!"},{"$error":"#N/A"},{"$error":"#N/A"},{"$error":"#VALUE!"},{"$error":"#VALUE!"},{"$error":"#N/A"},null,{"$error":"#VALUE!"},{"$error":"#N/A"},{"$error":"#N/A"},{"$error":"#N/A"},{"$error":"#N/A"},{"$error":"#VALUE!"},{"$error":"#VALUE!"},{"$error":"#N/A"},null,{"$error":"#VALUE!"},{"$error":"#N/A"},{"$error":"#N/A"},{"$error":"#N/A"},{"$error":"#N/A"},{"$error":"#VALUE!"},{"$error":"#VALUE!"},{"$error":"#N/A"},null,{"$error":"#VALUE!"},{"$error":"#N/A"},{"$error":"#N/A"},{"$error":"#N/A"},{"$error":"#N/A"},{"$error":"#VALUE!"},{"$error":"#VALUE!"},{"$error":"#N/A"},null,{"$error":"#VALUE!"},{"$error":"#N/A"},{"$error":"#N/A"},{"$error":"#N/A"},{"$error":"#N/A"},{"$error":"#VALUE!"},{"$error":"#VALUE!"},{"$error":"#N/A"},null,{"$error":"#VALUE!"},{"$error":"#N/A"},{"$error":"#N/A"},{"$error":"#N/A"},{"$error":"#N/A"},{"$error":"#VALUE!"},{"$error":"#VALUE!"},{"$error":"#N/A"},null,{"$error":"#VALUE!"},{"$error":"#N/A"},{"$error":"#N/A"},{"$error":"#N/A"},{"$error":"#N/A"},{"$error":"#VALUE!"},{"$error":"#VALUE!"},{"$error":"#N/A"},null,{"$error":"#VALUE!"},{"$error":"#N/A"},{"$error":"#N/A"},{"$error":"#N/A"},{"$error":"#N/A"},{"$error":"#VALUE!"},{"$error":"#VALUE!"},{"$error":"#N/A"},null,{"$error":"#VALUE!"},{"$error":"#N/A"},{"$error":"#N/A"},{"$error":"#N/A"},{"$error":"#N/A"},{"$error":"#VALUE!"},{"$error":"#VALUE!"},{"$error":"#N/A"},null,{"$error":"#VALUE!"},{"$error":"#N/A"},{"$error":"#N/A"},{"$error":"#N/A"},{"$error":"#N/A"},{"$error":"#VALUE!"},{"$error":"#VALUE!"},{"$error":"#N/A"},null,{"$error":"#VALUE!"},{"$error":"#N/A"},{"$error":"#N/A"},{"$error":"#N/A"},{"$error":"#N/A"},{"$error":"#VALUE!"},{"$error":"#VALUE!"},{"$error":"#N/A"},null,{"$error":"#VALUE!"},{"$error":"#N/A"},{"$error":"#N/A"},{"$error":"#N/A"},{"$error":"#N/A"},{"$error":"#VALUE!"},{"$error":"#VALUE!"},{"$error":"#N/A"}]
[2032,{"$error":"#VALUE!"},{"$error":"#N/A"},{"$error":"#VALUE!"},{"$error":"#N/A"},{"$error":"#N/A"},{"$error":"#VALUE!"},{"$error":"#VALUE!"},{"$error":"#N/A"},null,{"$error":"#VALUE!"},{"$error":"#N/A"},{"$error":"#N/A"},{"$error":"#N/A"},{"$error":"#N/A"},{"$error":"#VALUE!"},{"$error":"#VALUE!"},{"$error":"#N/A"},null,{"$error":"#VALUE!"},{"$error":"#N/A"},{"$error":"#N/A"},{"$error":"#N/A"},{"$error":"#N/A"},{"$error":"#VALUE!"},{"$error":"#VALUE!"},{"$error":"#N/A"},null,{"$error":"#VALUE!"},{"$error":"#N/A"},{"$error":"#N/A"},{"$error":"#N/A"},{"$error":"#N/A"},{"$error":"#VALUE!"},{"$error":"#VALUE!"},{"$error":"#N/A"},null,{"$error":"#VALUE!"},{"$error":"#N/A"},{"$error":"#N/A"},{"$error":"#N/A"},{"$error":"#N/A"},{"$error":"#VALUE!"},{"$error":"#VALUE!"},{"$error":"#N/A"},null,{"$error":"#VALUE!"},{"$error":"#N/A"},{"$error":"#N/A"},{"$error":"#N/A"},{"$error":"#N/A"},{"$error":"#VALUE!"},{"$error":"#VALUE!"},{"$error":"#N/A"},null,{"$error":"#VALUE!"},{"$error":"#N/A"},{"$error":"#N/A"},{"$error":"#N/A"},{"$error":"#N/A"},{"$error":"#VALUE!"},{"$error":"#VALUE!"},{"$error":"#N/A"},null,{"$error":"#VALUE!"},{"$error":"#N/A"},{"$error":"#N/A"},{"$error":"#N/A"},{"$error":"#N/A"},{"$error":"#VALUE!"},{"$error":"#VALUE!"},{"$error":"#N/A"},null,{"$error":"#VALUE!"},{"$error":"#N/A"},{"$error":"#N/A"},{"$error":"#N/A"},{"$error":"#N/A"},{"$error":"#VALUE!"},{"$error":"#VALUE!"},{"$error":"#N/A"},null,{"$error":"#VALUE!"},{"$error":"#N/A"},{"$error":"#N/A"},{"$error":"#N/A"},{"$error":"#N/A"},{"$error":"#VALUE!"},{"$error":"#VALUE!"},{"$error":"#N/A"},null,{"$error":"#VALUE!"},{"$error":"#N/A"},{"$error":"#N/A"},{"$error":"#N/A"},{"$error":"#N/A"},{"$error":"#VALUE!"},{"$error":"#VALUE!"},{"$error":"#N/A"},null,{"$error":"#VALUE!"},{"$error":"#N/A"},{"$error":"#N/A"},{"$error":"#N/A"},{"$error":"#N/A"},{"$error":"#VALUE!"},{"$error":"#VALUE!"},{"$error":"#N/A"}]
[2033,{"$error":"#VALUE!"},{"$error":"#N/A"},{"$error":"#VALUE!"},{"$error":"#N/A"},{"$error":"#N/A"},{"$error":"#VALUE!"},{"$error":"#VALUE!"},{"$error":"#N/A"},null,{"$error":"#VALUE!"},{"$error":"#N/A"},{"$error":"#N/A"},{"$error":"#N/A"},{"$error":"#N/A"},{"$error":"#VALUE!"},{"$error":"#VALUE!"},{"$error":"#N/A"},null,{"$error":"#VALUE!"},{"$error":"#N/A"},{"$error":"#N/A"},{"$error":"#N/A"},{"$error":"#N/A"},{"$error":"#VALUE!"},{"$error":"#VALUE!"},{"$error":"#N/A"},null,{"$error":"#VALUE!"},{"$error":"#N/A"},{"$error":"#N/A"},{"$error":"#N/A"},{"$error":"#N/A"},{"$error":"#VALUE!"},{"$error":"#VALUE!"},{"$error":"#N/A"},null,{"$error":"#VALUE!"},{"$error":"#N/A"},{"$error":"#N/A"},{"$error":"#N/A"},{"$error":"#N/A"},{"$error":"#VALUE!"},{"$error":"#VALUE!"},{"$error":"#N/A"},null,{"$error":"#VALUE!"},{"$error":"#N/A"},{"$error":"#N/A"},{"$error":"#N/A"},{"$error":"#N/A"},{"$error":"#VALUE!"},{"$error":"#VALUE!"},{"$error":"#N/A"},null,{"$error":"#VALUE!"},{"$error":"#N/A"},{"$error":"#N/A"},{"$error":"#N/A"},{"$error":"#N/A"},{"$error":"#VALUE!"},{"$error":"#VALUE!"},{"$error":"#N/A"},null,{"$error":"#VALUE!"},{"$error":"#N/A"},{"$error":"#N/A"},{"$error":"#N/A"},{"$error":"#N/A"},{"$error":"#VALUE!"},{"$error":"#VALUE!"},{"$error":"#N/A"},null,{"$error":"#VALUE!"},{"$error":"#N/A"},{"$error":"#N/A"},{"$error":"#N/A"},{"$error":"#N/A"},{"$error":"#VALUE!"},{"$error":"#VALUE!"},{"$error":"#N/A"},null,{"$error":"#VALUE!"},{"$error":"#N/A"},{"$error":"#N/A"},{"$error":"#N/A"},{"$error":"#N/A"},{"$error":"#VALUE!"},{"$error":"#VALUE!"},{"$error":"#N/A"},null,{"$error":"#VALUE!"},{"$error":"#N/A"},{"$error":"#N/A"},{"$error":"#N/A"},{"$error":"#N/A"},{"$error":"#VALUE!"},{"$error":"#VALUE!"},{"$error":"#N/A"},null,{"$error":"#VALUE!"},{"$error":"#N/A"},{"$error":"#N/A"},{"$error":"#N/A"},{"$error":"#N/A"},{"$error":"#VALUE!"},{"$error":"#VALUE!"},{"$error":"#N/A"}]
[2034,{"$error":"#VALUE!"},{"$error":"#N/A"},{"$error":"#VALUE!"},{"$error":"#N/A"},{"$error":"#N/A"},{"$error":"#VALUE!"},{"$error":"#VALUE!"},{"$error":"#N/A"},null,{"$error":"#VALUE!"},{"$error":"#N/A"},{"$error":"#N/A"},{"$error":"#N/A"},{"$error":"#N/A"},{"$error":"#VALUE!"},{"$error":"#VALUE!"},{"$error":"#N/A"},null,{"$error":"#VALUE!"},{"$error":"#N/A"},{"$error":"#N/A"},{"$error":"#N/A"},{"$error":"#N/A"},{"$error":"#VALUE!"},{"$error":"#VALUE!"},{"$error":"#N/A"},null,{"$error":"#VALUE!"},{"$error":"#N/A"},{"$error":"#N/A"},{"$error":"#N/A"},{"$error":"#N/A"},{"$error":"#VALUE!"},{"$error":"#VALUE!"},{"$error":"#N/A"},null,{"$error":"#VALUE!"},{"$error":"#N/A"},{"$error":"#N/A"},{"$error":"#N/A"},{"$error":"#N/A"},{"$error":"#VALUE!"},{"$error":"#VALUE!"},{"$error":"#N/A"},null,{"$error":"#VALUE!"},{"$error":"#N/A"},{"$error":"#N/A"},{"$error":"#N/A"},{"$error":"#N/A"},{"$error":"#VALUE!"},{"$error":"#VALUE!"},{"$error":"#N/A"},null,{"$error":"#VALUE!"},{"$error":"#N/A"},{"$error":"#N/A"},{"$error":"#N/A"},{"$error":"#N/A"},{"$error":"#VALUE!"},{"$error":"#VALUE!"},{"$error":"#N/A"},null,{"$error":"#VALUE!"},{"$error":"#N/A"},{"$error":"#N/A"},{"$error":"#N/A"},{"$error":"#N/A"},{"$error":"#VALUE!"},{"$error":"#VALUE!"},{"$error":"#N/A"},null,{"$error":"#VALUE!"},{"$error":"#N/A"},{"$error":"#N/A"},{"$error":"#N/A"},{"$error":"#N/A"},{"$error":"#VALUE!"},{"$error":"#VALUE!"},{"$error":"#N/A"},null,{"$error":"#VALUE!"},{"$error":"#N/A"},{"$error":"#N/A"},{"$error":"#N/A"},{"$error":"#N/A"},{"$error":"#VALUE!"},{"$error":"#VALUE!"},{"$error":"#N/A"},null,{"$error":"#VALUE!"},{"$error":"#N/A"},{"$error":"#N/A"},{"$error":"#N/A"},{"$error":"#N/A"},{"$error":"#VALUE!"},{"$error":"#VALUE!"},{"$error":"#N/A"},null,{"$error":"#VALUE!"},{"$error":"#N/A"},{"$error":"#N/A"},{"$error":"#N/A"},{"$error":"#N/A"},{"$error":"#VALUE!"},{"$error":"#VALUE!"},{"$error":"#N/A"}]
[2035,{"$error":"#VALUE!"},{"$error":"#N/A"},{"$error":"#VALUE!"},{"$error":"#N/A"},{"$error":"#N/A"},{"$error":"#VALUE!"},{"$error":"#VALUE!"},{"$error":"#N/A"},null,{"$error":"#VALUE!"},{"$error":"#N/A"},{"$error":"#N/A"},{"$error":"#N/A"},{"$error":"#N/A"},{"$error":"#VALUE!"},{"$error":"#VALUE!"},{"$error":"#N/A"},null,{"$error":"#VALUE!"},{"$error":"#N/A"},{"$error":"#N/A"},{"$error":"#N/A"},{"$error":"#N/A"},{"$error":"#VALUE!"},{"$error":"#VALUE!"},{"$error":"#N/A"},null,{"$error":"#VALUE!"},{"$error":"#N/A"},{"$error":"#N/A"},{"$error":"#N/A"},{"$error":"#N/A"},{"$error":"#VALUE!"},{"$error":"#VALUE!"},{"$error":"#N/A"},null,{"$error":"#VALUE!"},{"$error":"#N/A"},{"$error":"#N/A"},{"$error":"#N/A"},{"$error":"#N/A"},{"$error":"#VALUE!"},{"$error":"#VALUE!"},{"$error":"#N/A"},null,{"$error":"#VALUE!"},{"$error":"#N/A"},{"$error":"#N/A"},{"$error":"#N/A"},{"$error":"#N/A"},{"$error":"#VALUE!"},{"$error":"#VALUE!"},{"$error":"#N/A"},null,{"$error":"#VALUE!"},{"$error":"#N/A"},{"$error":"#N/A"},{"$error":"#N/A"},{"$error":"#N/A"},{"$error":"#VALUE!"},{"$error":"#VALUE!"},{"$error":"#N/A"},null,{"$error":"#VALUE!"},{"$error":"#N/A"},{"$error":"#N/A"},{"$error":"#N/A"},{"$error":"#N/A"},{"$error":"#VALUE!"},{"$error":"#VALUE!"},{"$error":"#N/A"},null,{"$error":"#VALUE!"},{"$error":"#N/A"},{"$error":"#N/A"},{"$error":"#N/A"},{"$error":"#N/A"},{"$error":"#VALUE!"},{"$error":"#VALUE!"},{"$error":"#N/A"},null,{"$error":"#VALUE!"},{"$error":"#N/A"},{"$error":"#N/A"},{"$error":"#N/A"},{"$error":"#N/A"},{"$error":"#VALUE!"},{"$error":"#VALUE!"},{"$error":"#N/A"},null,{"$error":"#VALUE!"},{"$error":"#N/A"},{"$error":"#N/A"},{"$error":"#N/A"},{"$error":"#N/A"},{"$error":"#VALUE!"},{"$error":"#VALUE!"},{"$error":"#N/A"},null,{"$error":"#VALUE!"},{"$error":"#N/A"},{"$error":"#N/A"},{"$error":"#N/A"},{"$error":"#N/A"},{"$error":"#VALUE!"},{"$error":"#VALUE!"},{"$error":"#N/A"}]
[2036,{"$error":"#VALUE!"},{"$error":"#N/A"},{"$error":"#VALUE!"},{"$error":"#N/A"},{"$error":"#N/A"},{"$error":"#VALUE!"},{"$error":"#VALUE!"},{"$error":"#N/A"},null,{"$error":"#VALUE!"},{"$error":"#N/A"},{"$error":"#N/A"},{"$error":"#N/A"},{"$error":"#N/A"},{"$error":"#VALUE!"},{"$error":"#VALUE!"},{"$error":"#N/A"},null,{"$error":"#VALUE!"},{"$error":"#N/A"},{"$error":"#N/A"},{"$error":"#N/A"},{"$error":"#N/A"},{"$error":"#VALUE!"},{"$error":"#VALUE!"},{"$error":"#N/A"},null,{"$error":"#VALUE!"},{"$error":"#N/A"},{"$error":"#N/A"},{"$error":"#N/A"},{"$error":"#N/A"},{"$error":"#VALUE!"},{"$error":"#VALUE!"},{"$error":"#N/A"},null,{"$error":"#VALUE!"},{"$error":"#N/A"},{"$error":"#N/A"},{"$error":"#N/A"},{"$error":"#N/A"},{"$error":"#VALUE!"},{"$error":"#VALUE!"},{"$error":"#N/A"},null,{"$error":"#VALUE!"},{"$error":"#N/A"},{"$error":"#N/A"},{"$error":"#N/A"},{"$error":"#N/A"},{"$error":"#VALUE!"},{"$error":"#VALUE!"},{"$error":"#N/A"},null,{"$error":"#VALUE!"},{"$error":"#N/A"},{"$error":"#N/A"},{"$error":"#N/A"},{"$error":"#N/A"},{"$error":"#VALUE!"},{"$error":"#VALUE!"},{"$error":"#N/A"},null,{"$error":"#VALUE!"},{"$error":"#N/A"},{"$error":"#N/A"},{"$error":"#N/A"},{"$error":"#N/A"},{"$error":"#VALUE!"},{"$error":"#VALUE!"},{"$error":"#N/A"},null,{"$error":"#VALUE!"},{"$error":"#N/A"},{"$error":"#N/A"},{"$error":"#N/A"},{"$error":"#N/A"},{"$error":"#VALUE!"},{"$error":"#VALUE!"},{"$error":"#N/A"},null,{"$error":"#VALUE!"},{"$error":"#N/A"},{"$error":"#N/A"},{"$error":"#N/A"},{"$error":"#N/A"},{"$error":"#VALUE!"},{"$error":"#VALUE!"},{"$error":"#N/A"},null,{"$error":"#VALUE!"},{"$error":"#N/A"},{"$error":"#N/A"},{"$error":"#N/A"},{"$error":"#N/A"},{"$error":"#VALUE!"},{"$error":"#VALUE!"},{"$error":"#N/A"},null,{"$error":"#VALUE!"},{"$error":"#N/A"},{"$error":"#N/A"},{"$error":"#N/A"},{"$error":"#N/A"},{"$error":"#VALUE!"},{"$error":"#VALUE!"},{"$error":"#N/A"}]
[2037,{"$error":"#VALUE!"},{"$error":"#N/A"},{"$error":"#VALUE!"},{"$error":"#N/A"},{"$error":"#N/A"},{"$error":"#VALUE!"},{"$error":"#VALUE!"},{"$error":"#N/A"},null,{"$error":"#VALUE!"},{"$error":"#N/A"},{"$error":"#N/A"},{"$error":"#N/A"},{"$error":"#N/A"},{"$error":"#VALUE!"},{"$error":"#VALUE!"},{"$error":"#N/A"},null,{"$error":"#VALUE!"},{"$error":"#N/A"},{"$error":"#N/A"},{"$error":"#N/A"},{"$error":"#N/A"},{"$error":"#VALUE!"},{"$error":"#VALUE!"},{"$error":"#N/A"},null,{"$error":"#VALUE!"},{"$error":"#N/A"},{"$error":"#N/A"},{"$error":"#N/A"},{"$error":"#N/A"},{"$error":"#VALUE!"},{"$error":"#VALUE!"},{"$error":"#N/A"},null,{"$error":"#VALUE!"},{"$error":"#N/A"},{"$error":"#N/A"},{"$error":"#N/A"},{"$error":"#N/A"},{"$error":"#VALUE!"},{"$error":"#VALUE!"},{"$error":"#N/A"},null,{"$error":"#VALUE!"},{"$error":"#N/A"},{"$error":"#N/A"},{"$error":"#N/A"},{"$error":"#N/A"},{"$error":"#VALUE!"},{"$error":"#VALUE!"},{"$error":"#N/A"},null,{"$error":"#VALUE!"},{"$error":"#N/A"},{"$error":"#N/A"},{"$error":"#N/A"},{"$error":"#N/A"},{"$error":"#VALUE!"},{"$error":"#VALUE!"},{"$error":"#N/A"},null,{"$error":"#VALUE!"},{"$error":"#N/A"},{"$error":"#N/A"},{"$error":"#N/A"},{"$error":"#N/A"},{"$error":"#VALUE!"},{"$error":"#VALUE!"},{"$error":"#N/A"},null,{"$error":"#VALUE!"},{"$error":"#N/A"},{"$error":"#N/A"},{"$error":"#N/A"},{"$error":"#N/A"},{"$error":"#VALUE!"},{"$error":"#VALUE!"},{"$error":"#N/A"},null,{"$error":"#VALUE!"},{"$error":"#N/A"},{"$error":"#N/A"},{"$error":"#N/A"},{"$error":"#N/A"},{"$error":"#VALUE!"},{"$error":"#VALUE!"},{"$error":"#N/A"},null,{"$error":"#VALUE!"},{"$error":"#N/A"},{"$error":"#N/A"},{"$error":"#N/A"},{"$error":"#N/A"},{"$error":"#VALUE!"},{"$error":"#VALUE!"},{"$error":"#N/A"},null,{"$error":"#VALUE!"},{"$error":"#N/A"},{"$error":"#N/A"},{"$error":"#N/A"},{"$error":"#N/A"},{"$error":"#VALUE!"},{"$error":"#VALUE!"},{"$error":"#N/A"}]
[{"$f":"A29+1","v":2038},{"$error":"#VALUE!"},{"$error":"#N/A"},{"$error":"#VALUE!"},{"$error":"#N/A"},{"$error":"#N/A"},{"$error":"#VALUE!"},{"$error":"#VALUE!"},{"$error":"#N/A"},null,{"$error":"#VALUE!"},{"$error":"#N/A"},{"$error":"#N/A"},{"$error":"#N/A"},{"$error":"#N/A"},{"$error":"#VALUE!"},{"$error":"#VALUE!"},{"$error":"#N/A"},null,{"$error":"#VALUE!"},{"$error":"#N/A"},{"$error":"#N/A"},{"$error":"#N/A"},{"$error":"#N/A"},{"$error":"#VALUE!"},{"$error":"#VALUE!"},{"$error":"#N/A"},null,{"$error":"#VALUE!"},{"$error":"#N/A"},{"$error":"#N/A"},{"$error":"#N/A"},{"$error":"#N/A"},{"$error":"#VALUE!"},{"$error":"#VALUE!"},{"$error":"#N/A"},null,{"$error":"#VALUE!"},{"$error":"#N/A"},{"$error":"#N/A"},{"$error":"#N/A"},{"$error":"#N/A"},{"$error":"#VALUE!"},{"$error":"#VALUE!"},{"$error":"#N/A"},null,{"$error":"#VALUE!"},{"$error":"#N/A"},{"$error":"#N/A"},{"$error":"#N/A"},{"$error":"#N/A"},{"$error":"#VALUE!"},{"$error":"#VALUE!"},{"$error":"#N/A"},null,{"$error":"#VALUE!"},{"$error":"#N/A"},{"$error":"#N/A"},{"$error":"#N/A"},{"$error":"#N/A"},{"$error":"#VALUE!"},{"$error":"#VALUE!"},{"$error":"#N/A"},null,{"$error":"#VALUE!"},{"$error":"#N/A"},{"$error":"#N/A"},{"$error":"#N/A"},{"$error":"#N/A"},{"$error":"#VALUE!"},{"$error":"#VALUE!"},{"$error":"#N/A"},null,{"$error":"#VALUE!"},{"$error":"#N/A"},{"$error":"#N/A"},{"$error":"#N/A"},{"$error":"#N/A"},{"$error":"#VALUE!"},{"$error":"#VALUE!"},{"$error":"#N/A"},null,{"$error":"#VALUE!"},{"$error":"#N/A"},{"$error":"#N/A"},{"$error":"#N/A"},{"$error":"#N/A"},{"$error":"#VALUE!"},{"$error":"#VALUE!"},{"$error":"#N/A"},null,{"$error":"#VALUE!"},{"$error":"#N/A"},{"$error":"#N/A"},{"$error":"#N/A"},{"$error":"#N/A"},{"$error":"#VALUE!"},{"$error":"#VALUE!"},{"$error":"#N/A"},null,{"$error":"#VALUE!"},{"$error":"#N/A"},{"$error":"#N/A"},{"$error":"#N/A"},{"$error":"#N/A"},{"$error":"#VALUE!"},{"$error":"#VALUE!"},{"$error":"#N/A"}]
[2039,{"$error":"#VALUE!"},{"$error":"#N/A"},{"$error":"#VALUE!"},{"$error":"#N/A"},{"$error":"#N/A"},{"$error":"#VALUE!"},{"$error":"#VALUE!"},{"$error":"#N/A"},null,{"$error":"#VALUE!"},{"$error":"#N/A"},{"$error":"#N/A"},{"$error":"#N/A"},{"$error":"#N/A"},{"$error":"#VALUE!"},{"$error":"#VALUE!"},{"$error":"#N/A"},null,{"$error":"#VALUE!"},{"$error":"#N/A"},{"$error":"#N/A"},{"$error":"#N/A"},{"$error":"#N/A"},{"$error":"#VALUE!"},{"$error":"#VALUE!"},{"$error":"#N/A"},null,{"$error":"#VALUE!"},{"$error":"#N/A"},{"$error":"#N/A"},{"$error":"#N/A"},{"$error":"#N/A"},{"$error":"#VALUE!"},{"$error":"#VALUE!"},{"$error":"#N/A"},null,{"$error":"#VALUE!"},{"$error":"#N/A"},{"$error":"#N/A"},{"$error":"#N/A"},{"$error":"#N/A"},{"$error":"#VALUE!"},{"$error":"#VALUE!"},{"$error":"#N/A"},null,{"$error":"#VALUE!"},{"$error":"#N/A"},{"$error":"#N/A"},{"$error":"#N/A"},{"$error":"#N/A"},{"$error":"#VALUE!"},{"$error":"#VALUE!"},{"$error":"#N/A"},null,{"$error":"#VALUE!"},{"$error":"#N/A"},{"$error":"#N/A"},{"$error":"#N/A"},{"$error":"#N/A"},{"$error":"#VALUE!"},{"$error":"#VALUE!"},{"$error":"#N/A"},null,{"$error":"#VALUE!"},{"$error":"#N/A"},{"$error":"#N/A"},{"$error":"#N/A"},{"$error":"#N/A"},{"$error":"#VALUE!"},{"$error":"#VALUE!"},{"$error":"#N/A"},null,{"$error":"#VALUE!"},{"$error":"#N/A"},{"$error":"#N/A"},{"$error":"#N/A"},{"$error":"#N/A"},{"$error":"#VALUE!"},{"$error":"#VALUE!"},{"$error":"#N/A"},null,{"$error":"#VALUE!"},{"$error":"#N/A"},{"$error":"#N/A"},{"$error":"#N/A"},{"$error":"#N/A"},{"$error":"#VALUE!"},{"$error":"#VALUE!"},{"$error":"#N/A"},null,{"$error":"#VALUE!"},{"$error":"#N/A"},{"$error":"#N/A"},{"$error":"#N/A"},{"$error":"#N/A"},{"$error":"#VALUE!"},{"$error":"#VALUE!"},{"$error":"#N/A"},null,{"$error":"#VALUE!"},{"$error":"#N/A"},{"$error":"#N/A"},{"$error":"#N/A"},{"$error":"#N/A"},{"$error":"#VALUE!"},{"$error":"#VALUE!"},{"$error":"#N/A"}]
[2040,{"$error":"#VALUE!"},{"$error":"#N/A"},{"$error":"#VALUE!"},{"$error":"#N/A"},{"$error":"#N/A"},{"$error":"#VALUE!"},{"$error":"#VALUE!"},{"$error":"#N/A"},null,{"$error":"#VALUE!"},{"$error":"#N/A"},{"$error":"#N/A"},{"$error":"#N/A"},{"$error":"#N/A"},{"$error":"#VALUE!"},{"$error":"#VALUE!"},{"$error":"#N/A"},null,{"$error":"#VALUE!"},{"$error":"#N/A"},{"$error":"#N/A"},{"$error":"#N/A"},{"$error":"#N/A"},{"$error":"#VALUE!"},{"$error":"#VALUE!"},{"$error":"#N/A"},null,{"$error":"#VALUE!"},{"$error":"#N/A"},{"$error":"#N/A"},{"$error":"#N/A"},{"$error":"#N/A"},{"$error":"#VALUE!"},{"$error":"#VALUE!"},{"$error":"#N/A"},null,{"$error":"#VALUE!"},{"$error":"#N/A"},{"$error":"#N/A"},{"$error":"#N/A"},{"$error":"#N/A"},{"$error":"#VALUE!"},{"$error":"#VALUE!"},{"$error":"#N/A"},null,{"$error":"#VALUE!"},{"$error":"#N/A"},{"$error":"#N/A"},{"$error":"#N/A"},{"$error":"#N/A"},{"$error":"#VALUE!"},{"$error":"#VALUE!"},{"$error":"#N/A"},null,{"$error":"#VALUE!"},{"$error":"#N/A"},{"$error":"#N/A"},{"$error":"#N/A"},{"$error":"#N/A"},{"$error":"#VALUE!"},{"$error":"#VALUE!"},{"$error":"#N/A"},null,{"$error":"#VALUE!"},{"$error":"#N/A"},{"$error":"#N/A"},{"$error":"#N/A"},{"$error":"#N/A"},{"$error":"#VALUE!"},{"$error":"#VALUE!"},{"$error":"#N/A"},null,{"$error":"#VALUE!"},{"$error":"#N/A"},{"$error":"#N/A"},{"$error":"#N/A"},{"$error":"#N/A"},{"$error":"#VALUE!"},{"$error":"#VALUE!"},{"$error":"#N/A"},null,{"$error":"#VALUE!"},{"$error":"#N/A"},{"$error":"#N/A"},{"$error":"#N/A"},{"$error":"#N/A"},{"$error":"#VALUE!"},{"$error":"#VALUE!"},{"$error":"#N/A"},null,{"$error":"#VALUE!"},{"$error":"#N/A"},{"$error":"#N/A"},{"$error":"#N/A"},{"$error":"#N/A"},{"$error":"#VALUE!"},{"$error":"#VALUE!"},{"$error":"#N/A"},null,{"$error":"#VALUE!"},{"$error":"#N/A"},{"$error":"#N/A"},{"$error":"#N/A"},{"$error":"#N/A"},{"$error":"#VALUE!"},{"$error":"#VALUE!"},{"$error":"#N/A"}]
[2041,{"$error":"#VALUE!"},{"$error":"#N/A"},{"$error":"#VALUE!"},{"$error":"#N/A"},{"$error":"#N/A"},{"$error":"#VALUE!"},{"$error":"#VALUE!"},{"$error":"#N/A"},null,{"$error":"#VALUE!"},{"$error":"#N/A"},{"$error":"#N/A"},{"$error":"#N/A"},{"$error":"#N/A"},{"$error":"#VALUE!"},{"$error":"#VALUE!"},{"$error":"#N/A"},null,{"$error":"#VALUE!"},{"$error":"#N/A"},{"$error":"#N/A"},{"$error":"#N/A"},{"$error":"#N/A"},{"$error":"#VALUE!"},{"$error":"#VALUE!"},{"$error":"#N/A"},null,{"$error":"#VALUE!"},{"$error":"#N/A"},{"$error":"#N/A"},{"$error":"#N/A"},{"$error":"#N/A"},{"$error":"#VALUE!"},{"$error":"#VALUE!"},{"$error":"#N/A"},null,{"$error":"#VALUE!"},{"$error":"#N/A"},{"$error":"#N/A"},{"$error":"#N/A"},{"$error":"#N/A"},{"$error":"#VALUE!"},{"$error":"#VALUE!"},{"$error":"#N/A"},null,{"$error":"#VALUE!"},{"$error":"#N/A"},{"$error":"#N/A"},{"$error":"#N/A"},{"$error":"#N/A"},{"$error":"#VALUE!"},{"$error":"#VALUE!"},{"$error":"#N/A"},null,{"$error":"#VALUE!"},{"$error":"#N/A"},{"$error":"#N/A"},{"$error":"#N/A"},{"$error":"#N/A"},{"$error":"#VALUE!"},{"$error":"#VALUE!"},{"$error":"#N/A"},null,{"$error":"#VALUE!"},{"$error":"#N/A"},{"$error":"#N/A"},{"$error":"#N/A"},{"$error":"#N/A"},{"$error":"#VALUE!"},{"$error":"#VALUE!"},{"$error":"#N/A"},null,{"$error":"#VALUE!"},{"$error":"#N/A"},{"$error":"#N/A"},{"$error":"#N/A"},{"$error":"#N/A"},{"$error":"#VALUE!"},{"$error":"#VALUE!"},{"$error":"#N/A"},null,{"$error":"#VALUE!"},{"$error":"#N/A"},{"$error":"#N/A"},{"$error":"#N/A"},{"$error":"#N/A"},{"$error":"#VALUE!"},{"$error":"#VALUE!"},{"$error":"#N/A"},null,{"$error":"#VALUE!"},{"$error":"#N/A"},{"$error":"#N/A"},{"$error":"#N/A"},{"$error":"#N/A"},{"$error":"#VALUE!"},{"$error":"#VALUE!"},{"$error":"#N/A"},null,{"$error":"#VALUE!"},{"$error":"#N/A"},{"$error":"#N/A"},{"$error":"#N/A"},{"$error":"#N/A"},{"$error":"#VALUE!"},{"$error":"#VALUE!"},{"$error":"#N/A"}]
[2042,{"$error":"#VALUE!"},{"$error":"#N/A"},{"$error":"#VALUE!"},{"$error":"#N/A"},{"$error":"#N/A"},{"$error":"#VALUE!"},{"$error":"#VALUE!"},{"$error":"#N/A"},null,{"$error":"#VALUE!"},{"$error":"#N/A"},{"$error":"#N/A"},{"$error":"#N/A"},{"$error":"#N/A"},{"$error":"#VALUE!"},{"$error":"#VALUE!"},{"$error":"#N/A"},null,{"$error":"#VALUE!"},{"$error":"#N/A"},{"$error":"#N/A"},{"$error":"#N/A"},{"$error":"#N/A"},{"$error":"#VALUE!"},{"$error":"#VALUE!"},{"$error":"#N/A"},null,{"$error":"#VALUE!"},{"$error":"#N/A"},{"$error":"#N/A"},{"$error":"#N/A"},{"$error":"#N/A"},{"$error":"#VALUE!"},{"$error":"#VALUE!"},{"$error":"#N/A"},null,{"$error":"#VALUE!"},{"$error":"#N/A"},{"$error":"#N/A"},{"$error":"#N/A"},{"$error":"#N/A"},{"$error":"#VALUE!"},{"$error":"#VALUE!"},{"$error":"#N/A"},null,{"$error":"#VALUE!"},{"$error":"#N/A"},{"$error":"#N/A"},{"$error":"#N/A"},{"$error":"#N/A"},{"$error":"#VALUE!"},{"$error":"#VALUE!"},{"$error":"#N/A"},null,{"$error":"#VALUE!"},{"$error":"#N/A"},{"$error":"#N/A"},{"$error":"#N/A"},{"$error":"#N/A"},{"$error":"#VALUE!"},{"$error":"#VALUE!"},{"$error":"#N/A"},null,{"$error":"#VALUE!"},{"$error":"#N/A"},{"$error":"#N/A"},{"$error":"#N/A"},{"$error":"#N/A"},{"$error":"#VALUE!"},{"$error":"#VALUE!"},{"$error":"#N/A"},null,{"$error":"#VALUE!"},{"$error":"#N/A"},{"$error":"#N/A"},{"$error":"#N/A"},{"$error":"#N/A"},{"$error":"#VALUE!"},{"$error":"#VALUE!"},{"$error":"#N/A"},null,{"$error":"#VALUE!"},{"$error":"#N/A"},{"$error":"#N/A"},{"$error":"#N/A"},{"$error":"#N/A"},{"$error":"#VALUE!"},{"$error":"#VALUE!"},{"$error":"#N/A"},null,{"$error":"#VALUE!"},{"$error":"#N/A"},{"$error":"#N/A"},{"$error":"#N/A"},{"$error":"#N/A"},{"$error":"#VALUE!"},{"$error":"#VALUE!"},{"$error":"#N/A"},null,{"$error":"#VALUE!"},{"$error":"#N/A"},{"$error":"#N/A"},{"$error":"#N/A"},{"$error":"#N/A"},{"$error":"#VALUE!"},{"$error":"#VALUE!"},{"$error":"#N/A"}]
[2043,{"$error":"#VALUE!"},{"$error":"#N/A"},{"$error":"#VALUE!"},{"$error":"#N/A"},{"$error":"#N/A"},{"$error":"#VALUE!"},{"$error":"#VALUE!"},{"$error":"#N/A"},null,{"$error":"#VALUE!"},{"$error":"#N/A"},{"$error":"#N/A"},{"$error":"#N/A"},{"$error":"#N/A"},{"$error":"#VALUE!"},{"$error":"#VALUE!"},{"$error":"#N/A"},null,{"$error":"#VALUE!"},{"$error":"#N/A"},{"$error":"#N/A"},{"$error":"#N/A"},{"$error":"#N/A"},{"$error":"#VALUE!"},{"$error":"#VALUE!"},{"$error":"#N/A"},null,{"$error":"#VALUE!"},{"$error":"#N/A"},{"$error":"#N/A"},{"$error":"#N/A"},{"$error":"#N/A"},{"$error":"#VALUE!"},{"$error":"#VALUE!"},{"$error":"#N/A"},null,{"$error":"#VALUE!"},{"$error":"#N/A"},{"$error":"#N/A"},{"$error":"#N/A"},{"$error":"#N/A"},{"$error":"#VALUE!"},{"$error":"#VALUE!"},{"$error":"#N/A"},null,{"$error":"#VALUE!"},{"$error":"#N/A"},{"$error":"#N/A"},{"$error":"#N/A"},{"$error":"#N/A"},{"$error":"#VALUE!"},{"$error":"#VALUE!"},{"$error":"#N/A"},null,{"$error":"#VALUE!"},{"$error":"#N/A"},{"$error":"#N/A"},{"$error":"#N/A"},{"$error":"#N/A"},{"$error":"#VALUE!"},{"$error":"#VALUE!"},{"$error":"#N/A"},null,{"$error":"#VALUE!"},{"$error":"#N/A"},{"$error":"#N/A"},{"$error":"#N/A"},{"$error":"#N/A"},{"$error":"#VALUE!"},{"$error":"#VALUE!"},{"$error":"#N/A"},null,{"$error":"#VALUE!"},{"$error":"#N/A"},{"$error":"#N/A"},{"$error":"#N/A"},{"$error":"#N/A"},{"$error":"#VALUE!"},{"$error":"#VALUE!"},{"$error":"#N/A"},null,{"$error":"#VALUE!"},{"$error":"#N/A"},{"$error":"#N/A"},{"$error":"#N/A"},{"$error":"#N/A"},{"$error":"#VALUE!"},{"$error":"#VALUE!"},{"$error":"#N/A"},null,{"$error":"#VALUE!"},{"$error":"#N/A"},{"$error":"#N/A"},{"$error":"#N/A"},{"$error":"#N/A"},{"$error":"#VALUE!"},{"$error":"#VALUE!"},{"$error":"#N/A"},null,{"$error":"#VALUE!"},{"$error":"#N/A"},{"$error":"#N/A"},{"$error":"#N/A"},{"$error":"#N/A"},{"$error":"#VALUE!"},{"$error":"#VALUE!"},{"$error":"#N/A"}]
[2044,{"$error":"#VALUE!"},{"$error":"#N/A"},{"$error":"#VALUE!"},{"$error":"#N/A"},{"$error":"#N/A"},{"$error":"#VALUE!"},{"$error":"#VALUE!"},{"$error":"#N/A"},null,{"$error":"#VALUE!"},{"$error":"#N/A"},{"$error":"#N/A"},{"$error":"#N/A"},{"$error":"#N/A"},{"$error":"#VALUE!"},{"$error":"#VALUE!"},{"$error":"#N/A"},null,{"$error":"#VALUE!"},{"$error":"#N/A"},{"$error":"#N/A"},{"$error":"#N/A"},{"$error":"#N/A"},{"$error":"#VALUE!"},{"$error":"#VALUE!"},{"$error":"#N/A"},null,{"$error":"#VALUE!"},{"$error":"#N/A"},{"$error":"#N/A"},{"$error":"#N/A"},{"$error":"#N/A"},{"$error":"#VALUE!"},{"$error":"#VALUE!"},{"$error":"#N/A"},null,{"$error":"#VALUE!"},{"$error":"#N/A"},{"$error":"#N/A"},{"$error":"#N/A"},{"$error":"#N/A"},{"$error":"#VALUE!"},{"$error":"#VALUE!"},{"$error":"#N/A"},null,{"$error":"#VALUE!"},{"$error":"#N/A"},{"$error":"#N/A"},{"$error":"#N/A"},{"$error":"#N/A"},{"$error":"#VALUE!"},{"$error":"#VALUE!"},{"$error":"#N/A"},null,{"$error":"#VALUE!"},{"$error":"#N/A"},{"$error":"#N/A"},{"$error":"#N/A"},{"$error":"#N/A"},{"$error":"#VALUE!"},{"$error":"#VALUE!"},{"$error":"#N/A"},null,{"$error":"#VALUE!"},{"$error":"#N/A"},{"$error":"#N/A"},{"$error":"#N/A"},{"$error":"#N/A"},{"$error":"#VALUE!"},{"$error":"#VALUE!"},{"$error":"#N/A"},null,{"$error":"#VALUE!"},{"$error":"#N/A"},{"$error":"#N/A"},{"$error":"#N/A"},{"$error":"#N/A"},{"$error":"#VALUE!"},{"$error":"#VALUE!"},{"$error":"#N/A"},null,{"$error":"#VALUE!"},{"$error":"#N/A"},{"$error":"#N/A"},{"$error":"#N/A"},{"$error":"#N/A"},{"$error":"#VALUE!"},{"$error":"#VALUE!"},{"$error":"#N/A"},null,{"$error":"#VALUE!"},{"$error":"#N/A"},{"$error":"#N/A"},{"$error":"#N/A"},{"$error":"#N/A"},{"$error":"#VALUE!"},{"$error":"#VALUE!"},{"$error":"#N/A"},null,{"$error":"#VALUE!"},{"$error":"#N/A"},{"$error":"#N/A"},{"$error":"#N/A"},{"$error":"#N/A"},{"$error":"#VALUE!"},{"$error":"#VALUE!"},{"$error":"#N/A"}]
[2045,{"$error":"#VALUE!"},{"$error":"#N/A"},{"$error":"#VALUE!"},{"$error":"#N/A"},{"$error":"#N/A"},{"$error":"#VALUE!"},{"$error":"#VALUE!"},{"$error":"#N/A"},null,{"$error":"#VALUE!"},{"$error":"#N/A"},{"$error":"#N/A"},{"$error":"#N/A"},{"$error":"#N/A"},{"$error":"#VALUE!"},{"$error":"#VALUE!"},{"$error":"#N/A"},null,{"$error":"#VALUE!"},{"$error":"#N/A"},{"$error":"#N/A"},{"$error":"#N/A"},{"$error":"#N/A"},{"$error":"#VALUE!"},{"$error":"#VALUE!"},{"$error":"#N/A"},null,{"$error":"#VALUE!"},{"$error":"#N/A"},{"$error":"#N/A"},{"$error":"#N/A"},{"$error":"#N/A"},{"$error":"#VALUE!"},{"$error":"#VALUE!"},{"$error":"#N/A"},null,{"$error":"#VALUE!"},{"$error":"#N/A"},{"$error":"#N/A"},{"$error":"#N/A"},{"$error":"#N/A"},{"$error":"#VALUE!"},{"$error":"#VALUE!"},{"$error":"#N/A"},null,{"$error":"#VALUE!"},{"$error":"#N/A"},{"$error":"#N/A"},{"$error":"#N/A"},{"$error":"#N/A"},{"$error":"#VALUE!"},{"$error":"#VALUE!"},{"$error":"#N/A"},null,{"$error":"#VALUE!"},{"$error":"#N/A"},{"$error":"#N/A"},{"$error":"#N/A"},{"$error":"#N/A"},{"$error":"#VALUE!"},{"$error":"#VALUE!"},{"$error":"#N/A"},null,{"$error":"#VALUE!"},{"$error":"#N/A"},{"$error":"#N/A"},{"$error":"#N/A"},{"$error":"#N/A"},{"$error":"#VALUE!"},{"$error":"#VALUE!"},{"$error":"#N/A"},null,{"$error":"#VALUE!"},{"$error":"#N/A"},{"$error":"#N/A"},{"$error":"#N/A"},{"$error":"#N/A"},{"$error":"#VALUE!"},{"$error":"#VALUE!"},{"$error":"#N/A"},null,{"$error":"#VALUE!"},{"$error":"#N/A"},{"$error":"#N/A"},{"$error":"#N/A"},{"$error":"#N/A"},{"$error":"#VALUE!"},{"$error":"#VALUE!"},{"$error":"#N/A"},null,{"$error":"#VALUE!"},{"$error":"#N/A"},{"$error":"#N/A"},{"$error":"#N/A"},{"$error":"#N/A"},{"$error":"#VALUE!"},{"$error":"#VALUE!"},{"$error":"#N/A"},null,{"$error":"#VALUE!"},{"$error":"#N/A"},{"$error":"#N/A"},{"$error":"#N/A"},{"$error":"#N/A"},{"$error":"#VALUE!"},{"$error":"#VALUE!"},{"$error":"#N/A"}]
[2046,{"$error":"#VALUE!"},{"$error":"#N/A"},{"$error":"#VALUE!"},{"$error":"#N/A"},{"$error":"#N/A"},{"$error":"#VALUE!"},{"$error":"#VALUE!"},{"$error":"#N/A"},null,{"$error":"#VALUE!"},{"$error":"#N/A"},{"$error":"#N/A"},{"$error":"#N/A"},{"$error":"#N/A"},{"$error":"#VALUE!"},{"$error":"#VALUE!"},{"$error":"#N/A"},null,{"$error":"#VALUE!"},{"$error":"#N/A"},{"$error":"#N/A"},{"$error":"#N/A"},{"$error":"#N/A"},{"$error":"#VALUE!"},{"$error":"#VALUE!"},{"$error":"#N/A"},null,{"$error":"#VALUE!"},{"$error":"#N/A"},{"$error":"#N/A"},{"$error":"#N/A"},{"$error":"#N/A"},{"$error":"#VALUE!"},{"$error":"#VALUE!"},{"$error":"#N/A"},null,{"$error":"#VALUE!"},{"$error":"#N/A"},{"$error":"#N/A"},{"$error":"#N/A"},{"$error":"#N/A"},{"$error":"#VALUE!"},{"$error":"#VALUE!"},{"$error":"#N/A"},null,{"$error":"#VALUE!"},{"$error":"#N/A"},{"$error":"#N/A"},{"$error":"#N/A"},{"$error":"#N/A"},{"$error":"#VALUE!"},{"$error":"#VALUE!"},{"$error":"#N/A"},null,{"$error":"#VALUE!"},{"$error":"#N/A"},{"$error":"#N/A"},{"$error":"#N/A"},{"$error":"#N/A"},{"$error":"#VALUE!"},{"$error":"#VALUE!"},{"$error":"#N/A"},null,{"$error":"#VALUE!"},{"$error":"#N/A"},{"$error":"#N/A"},{"$error":"#N/A"},{"$error":"#N/A"},{"$error":"#VALUE!"},{"$error":"#VALUE!"},{"$error":"#N/A"},null,{"$error":"#VALUE!"},{"$error":"#N/A"},{"$error":"#N/A"},{"$error":"#N/A"},{"$error":"#N/A"},{"$error":"#VALUE!"},{"$error":"#VALUE!"},{"$error":"#N/A"},null,{"$error":"#VALUE!"},{"$error":"#N/A"},{"$error":"#N/A"},{"$error":"#N/A"},{"$error":"#N/A"},{"$error":"#VALUE!"},{"$error":"#VALUE!"},{"$error":"#N/A"},null,{"$error":"#VALUE!"},{"$error":"#N/A"},{"$error":"#N/A"},{"$error":"#N/A"},{"$error":"#N/A"},{"$error":"#VALUE!"},{"$error":"#VALUE!"},{"$error":"#N/A"},null,{"$error":"#VALUE!"},{"$error":"#N/A"},{"$error":"#N/A"},{"$error":"#N/A"},{"$error":"#N/A"},{"$error":"#VALUE!"},{"$error":"#VALUE!"},{"$error":"#N/A"}]
[2047,{"$error":"#VALUE!"},{"$error":"#N/A"},{"$error":"#VALUE!"},{"$error":"#N/A"},{"$error":"#N/A"},{"$error":"#VALUE!"},{"$error":"#VALUE!"},{"$error":"#N/A"},null,{"$error":"#VALUE!"},{"$error":"#N/A"},{"$error":"#N/A"},{"$error":"#N/A"},{"$error":"#N/A"},{"$error":"#VALUE!"},{"$error":"#VALUE!"},{"$error":"#N/A"},null,{"$error":"#VALUE!"},{"$error":"#N/A"},{"$error":"#N/A"},{"$error":"#N/A"},{"$error":"#N/A"},{"$error":"#VALUE!"},{"$error":"#VALUE!"},{"$error":"#N/A"},null,{"$error":"#VALUE!"},{"$error":"#N/A"},{"$error":"#N/A"},{"$error":"#N/A"},{"$error":"#N/A"},{"$error":"#VALUE!"},{"$error":"#VALUE!"},{"$error":"#N/A"},null,{"$error":"#VALUE!"},{"$error":"#N/A"},{"$error":"#N/A"},{"$error":"#N/A"},{"$error":"#N/A"},{"$error":"#VALUE!"},{"$error":"#VALUE!"},{"$error":"#N/A"},null,{"$error":"#VALUE!"},{"$error":"#N/A"},{"$error":"#N/A"},{"$error":"#N/A"},{"$error":"#N/A"},{"$error":"#VALUE!"},{"$error":"#VALUE!"},{"$error":"#N/A"},null,{"$error":"#VALUE!"},{"$error":"#N/A"},{"$error":"#N/A"},{"$error":"#N/A"},{"$error":"#N/A"},{"$error":"#VALUE!"},{"$error":"#VALUE!"},{"$error":"#N/A"},null,{"$error":"#VALUE!"},{"$error":"#N/A"},{"$error":"#N/A"},{"$error":"#N/A"},{"$error":"#N/A"},{"$error":"#VALUE!"},{"$error":"#VALUE!"},{"$error":"#N/A"},null,{"$error":"#VALUE!"},{"$error":"#N/A"},{"$error":"#N/A"},{"$error":"#N/A"},{"$error":"#N/A"},{"$error":"#VALUE!"},{"$error":"#VALUE!"},{"$error":"#N/A"},null,{"$error":"#VALUE!"},{"$error":"#N/A"},{"$error":"#N/A"},{"$error":"#N/A"},{"$error":"#N/A"},{"$error":"#VALUE!"},{"$error":"#VALUE!"},{"$error":"#N/A"},null,{"$error":"#VALUE!"},{"$error":"#N/A"},{"$error":"#N/A"},{"$error":"#N/A"},{"$error":"#N/A"},{"$error":"#VALUE!"},{"$error":"#VALUE!"},{"$error":"#N/A"},null,{"$error":"#VALUE!"},{"$error":"#N/A"},{"$error":"#N/A"},{"$error":"#N/A"},{"$error":"#N/A"},{"$error":"#VALUE!"},{"$error":"#VALUE!"},{"$error":"#N/A"}]
[2048,{"$error":"#VALUE!"},{"$error":"#N/A"},{"$error":"#VALUE!"},{"$error":"#N/A"},{"$error":"#N/A"},{"$error":"#VALUE!"},{"$error":"#VALUE!"},{"$error":"#N/A"},null,{"$error":"#VALUE!"},{"$error":"#N/A"},{"$error":"#N/A"},{"$error":"#N/A"},{"$error":"#N/A"},{"$error":"#VALUE!"},{"$error":"#VALUE!"},{"$error":"#N/A"},null,{"$error":"#VALUE!"},{"$error":"#N/A"},{"$error":"#N/A"},{"$error":"#N/A"},{"$error":"#N/A"},{"$error":"#VALUE!"},{"$error":"#VALUE!"},{"$error":"#N/A"},null,{"$error":"#VALUE!"},{"$error":"#N/A"},{"$error":"#N/A"},{"$error":"#N/A"},{"$error":"#N/A"},{"$error":"#VALUE!"},{"$error":"#VALUE!"},{"$error":"#N/A"},null,{"$error":"#VALUE!"},{"$error":"#N/A"},{"$error":"#N/A"},{"$error":"#N/A"},{"$error":"#N/A"},{"$error":"#VALUE!"},{"$error":"#VALUE!"},{"$error":"#N/A"},null,{"$error":"#VALUE!"},{"$error":"#N/A"},{"$error":"#N/A"},{"$error":"#N/A"},{"$error":"#N/A"},{"$error":"#VALUE!"},{"$error":"#VALUE!"},{"$error":"#N/A"},null,{"$error":"#VALUE!"},{"$error":"#N/A"},{"$error":"#N/A"},{"$error":"#N/A"},{"$error":"#N/A"},{"$error":"#VALUE!"},{"$error":"#VALUE!"},{"$error":"#N/A"},null,{"$error":"#VALUE!"},{"$error":"#N/A"},{"$error":"#N/A"},{"$error":"#N/A"},{"$error":"#N/A"},{"$error":"#VALUE!"},{"$error":"#VALUE!"},{"$error":"#N/A"},null,{"$error":"#VALUE!"},{"$error":"#N/A"},{"$error":"#N/A"},{"$error":"#N/A"},{"$error":"#N/A"},{"$error":"#VALUE!"},{"$error":"#VALUE!"},{"$error":"#N/A"},null,{"$error":"#VALUE!"},{"$error":"#N/A"},{"$error":"#N/A"},{"$error":"#N/A"},{"$error":"#N/A"},{"$error":"#VALUE!"},{"$error":"#VALUE!"},{"$error":"#N/A"},null,{"$error":"#VALUE!"},{"$error":"#N/A"},{"$error":"#N/A"},{"$error":"#N/A"},{"$error":"#N/A"},{"$error":"#VALUE!"},{"$error":"#VALUE!"},{"$error":"#N/A"},null,{"$error":"#VALUE!"},{"$error":"#N/A"},{"$error":"#N/A"},{"$error":"#N/A"},{"$error":"#N/A"},{"$error":"#VALUE!"},{"$error":"#VALUE!"},{"$error":"#N/A"}]
[2049,{"$error":"#VALUE!"},{"$error":"#N/A"},{"$error":"#VALUE!"},{"$error":"#N/A"},{"$error":"#N/A"},{"$error":"#VALUE!"},{"$error":"#VALUE!"},{"$error":"#N/A"},null,{"$error":"#VALUE!"},{"$error":"#N/A"},{"$error":"#N/A"},{"$error":"#N/A"},{"$error":"#N/A"},{"$error":"#VALUE!"},{"$error":"#VALUE!"},{"$error":"#N/A"},null,{"$error":"#VALUE!"},{"$error":"#N/A"},{"$error":"#N/A"},{"$error":"#N/A"},{"$error":"#N/A"},{"$error":"#VALUE!"},{"$error":"#VALUE!"},{"$error":"#N/A"},null,{"$error":"#VALUE!"},{"$error":"#N/A"},{"$error":"#N/A"},{"$error":"#N/A"},{"$error":"#N/A"},{"$error":"#VALUE!"},{"$error":"#VALUE!"},{"$error":"#N/A"},null,{"$error":"#VALUE!"},{"$error":"#N/A"},{"$error":"#N/A"},{"$error":"#N/A"},{"$error":"#N/A"},{"$error":"#VALUE!"},{"$error":"#VALUE!"},{"$error":"#N/A"},null,{"$error":"#VALUE!"},{"$error":"#N/A"},{"$error":"#N/A"},{"$error":"#N/A"},{"$error":"#N/A"},{"$error":"#VALUE!"},{"$error":"#VALUE!"},{"$error":"#N/A"},null,{"$error":"#VALUE!"},{"$error":"#N/A"},{"$error":"#N/A"},{"$error":"#N/A"},{"$error":"#N/A"},{"$error":"#VALUE!"},{"$error":"#VALUE!"},{"$error":"#N/A"},null,{"$error":"#VALUE!"},{"$error":"#N/A"},{"$error":"#N/A"},{"$error":"#N/A"},{"$error":"#N/A"},{"$error":"#VALUE!"},{"$error":"#VALUE!"},{"$error":"#N/A"},null,{"$error":"#VALUE!"},{"$error":"#N/A"},{"$error":"#N/A"},{"$error":"#N/A"},{"$error":"#N/A"},{"$error":"#VALUE!"},{"$error":"#VALUE!"},{"$error":"#N/A"},null,{"$error":"#VALUE!"},{"$error":"#N/A"},{"$error":"#N/A"},{"$error":"#N/A"},{"$error":"#N/A"},{"$error":"#VALUE!"},{"$error":"#VALUE!"},{"$error":"#N/A"},null,{"$error":"#VALUE!"},{"$error":"#N/A"},{"$error":"#N/A"},{"$error":"#N/A"},{"$error":"#N/A"},{"$error":"#VALUE!"},{"$error":"#VALUE!"},{"$error":"#N/A"},null,{"$error":"#VALUE!"},{"$error":"#N/A"},{"$error":"#N/A"},{"$error":"#N/A"},{"$error":"#N/A"},{"$error":"#VALUE!"},{"$error":"#VALUE!"},{"$error":"#N/A"}]
[2050,{"$error":"#VALUE!"},{"$error":"#N/A"},{"$error":"#VALUE!"},{"$error":"#N/A"},{"$error":"#N/A"},{"$error":"#VALUE!"},{"$error":"#VALUE!"},{"$error":"#N/A"},null,{"$error":"#VALUE!"},{"$error":"#N/A"},{"$error":"#N/A"},{"$error":"#N/A"},{"$error":"#N/A"},{"$error":"#VALUE!"},{"$error":"#VALUE!"},{"$error":"#N/A"},null,{"$error":"#VALUE!"},{"$error":"#N/A"},{"$error":"#N/A"},{"$error":"#N/A"},{"$error":"#N/A"},{"$error":"#VALUE!"},{"$error":"#VALUE!"},{"$error":"#N/A"},null,{"$error":"#VALUE!"},{"$error":"#N/A"},{"$error":"#N/A"},{"$error":"#N/A"},{"$error":"#N/A"},{"$error":"#VALUE!"},{"$error":"#VALUE!"},{"$error":"#N/A"},null,{"$error":"#VALUE!"},{"$error":"#N/A"},{"$error":"#N/A"},{"$error":"#N/A"},{"$error":"#N/A"},{"$error":"#VALUE!"},{"$error":"#VALUE!"},{"$error":"#N/A"},null,{"$error":"#VALUE!"},{"$error":"#N/A"},{"$error":"#N/A"},{"$error":"#N/A"},{"$error":"#N/A"},{"$error":"#VALUE!"},{"$error":"#VALUE!"},{"$error":"#N/A"},null,{"$error":"#VALUE!"},{"$error":"#N/A"},{"$error":"#N/A"},{"$error":"#N/A"},{"$error":"#N/A"},{"$error":"#VALUE!"},{"$error":"#VALUE!"},{"$error":"#N/A"},null,{"$error":"#VALUE!"},{"$error":"#N/A"},{"$error":"#N/A"},{"$error":"#N/A"},{"$error":"#N/A"},{"$error":"#VALUE!"},{"$error":"#VALUE!"},{"$error":"#N/A"},null,{"$error":"#VALUE!"},{"$error":"#N/A"},{"$error":"#N/A"},{"$error":"#N/A"},{"$error":"#N/A"},{"$error":"#VALUE!"},{"$error":"#VALUE!"},{"$error":"#N/A"},null,{"$error":"#VALUE!"},{"$error":"#N/A"},{"$error":"#N/A"},{"$error":"#N/A"},{"$error":"#N/A"},{"$error":"#VALUE!"},{"$error":"#VALUE!"},{"$error":"#N/A"},null,{"$error":"#VALUE!"},{"$error":"#N/A"},{"$error":"#N/A"},{"$error":"#N/A"},{"$error":"#N/A"},{"$error":"#VALUE!"},{"$error":"#VALUE!"},{"$error":"#N/A"},null,{"$error":"#VALUE!"},{"$error":"#N/A"},{"$error":"#N/A"},{"$error":"#N/A"},{"$error":"#N/A"},{"$error":"#VALUE!"},{"$error":"#VALUE!"},{"$error":"#N/A"}]
[2051,{"$error":"#VALUE!"},{"$error":"#N/A"},{"$error":"#VALUE!"},{"$error":"#N/A"},{"$error":"#N/A"},{"$error":"#VALUE!"},{"$error":"#VALUE!"},{"$error":"#N/A"},null,{"$error":"#VALUE!"},{"$error":"#N/A"},{"$error":"#N/A"},{"$error":"#N/A"},{"$error":"#N/A"},{"$error":"#VALUE!"},{"$error":"#VALUE!"},{"$error":"#N/A"},null,{"$error":"#VALUE!"},{"$error":"#N/A"},{"$error":"#N/A"},{"$error":"#N/A"},{"$error":"#N/A"},{"$error":"#VALUE!"},{"$error":"#VALUE!"},{"$error":"#N/A"},null,{"$error":"#VALUE!"},{"$error":"#N/A"},{"$error":"#N/A"},{"$error":"#N/A"},{"$error":"#N/A"},{"$error":"#VALUE!"},{"$error":"#VALUE!"},{"$error":"#N/A"},null,{"$error":"#VALUE!"},{"$error":"#N/A"},{"$error":"#N/A"},{"$error":"#N/A"},{"$error":"#N/A"},{"$error":"#VALUE!"},{"$error":"#VALUE!"},{"$error":"#N/A"},null,{"$error":"#VALUE!"},{"$error":"#N/A"},{"$error":"#N/A"},{"$error":"#N/A"},{"$error":"#N/A"},{"$error":"#VALUE!"},{"$error":"#VALUE!"},{"$error":"#N/A"},null,{"$error":"#VALUE!"},{"$error":"#N/A"},{"$error":"#N/A"},{"$error":"#N/A"},{"$error":"#N/A"},{"$error":"#VALUE!"},{"$error":"#VALUE!"},{"$error":"#N/A"},null,{"$error":"#VALUE!"},{"$error":"#N/A"},{"$error":"#N/A"},{"$error":"#N/A"},{"$error":"#N/A"},{"$error":"#VALUE!"},{"$error":"#VALUE!"},{"$error":"#N/A"},null,{"$error":"#VALUE!"},{"$error":"#N/A"},{"$error":"#N/A"},{"$error":"#N/A"},{"$error":"#N/A"},{"$error":"#VALUE!"},{"$error":"#VALUE!"},{"$error":"#N/A"},null,{"$error":"#VALUE!"},{"$error":"#N/A"},{"$error":"#N/A"},{"$error":"#N/A"},{"$error":"#N/A"},{"$error":"#VALUE!"},{"$error":"#VALUE!"},{"$error":"#N/A"},null,{"$error":"#VALUE!"},{"$error":"#N/A"},{"$error":"#N/A"},{"$error":"#N/A"},{"$error":"#N/A"},{"$error":"#VALUE!"},{"$error":"#VALUE!"},{"$error":"#N/A"},null,{"$error":"#VALUE!"},{"$error":"#N/A"},{"$error":"#N/A"},{"$error":"#N/A"},{"$error":"#N/A"},{"$error":"#VALUE!"},{"$error":"#VALUE!"},{"$error":"#N/A"}]
[2052,{"$error":"#VALUE!"},{"$error":"#N/A"},{"$error":"#VALUE!"},{"$error":"#N/A"},{"$error":"#N/A"},{"$error":"#VALUE!"},{"$error":"#VALUE!"},{"$error":"#N/A"},null,{"$error":"#VALUE!"},{"$error":"#N/A"},{"$error":"#N/A"},{"$error":"#N/A"},{"$error":"#N/A"},{"$error":"#VALUE!"},{"$error":"#VALUE!"},{"$error":"#N/A"},null,{"$error":"#VALUE!"},{"$error":"#N/A"},{"$error":"#N/A"},{"$error":"#N/A"},{"$error":"#N/A"},{"$error":"#VALUE!"},{"$error":"#VALUE!"},{"$error":"#N/A"},null,{"$error":"#VALUE!"},{"$error":"#N/A"},{"$error":"#N/A"},{"$error":"#N/A"},{"$error":"#N/A"},{"$error":"#VALUE!"},{"$error":"#VALUE!"},{"$error":"#N/A"},null,{"$error":"#VALUE!"},{"$error":"#N/A"},{"$error":"#N/A"},{"$error":"#N/A"},{"$error":"#N/A"},{"$error":"#VALUE!"},{"$error":"#VALUE!"},{"$error":"#N/A"},null,{"$error":"#VALUE!"},{"$error":"#N/A"},{"$error":"#N/A"},{"$error":"#N/A"},{"$error":"#N/A"},{"$error":"#VALUE!"},{"$error":"#VALUE!"},{"$error":"#N/A"},null,{"$error":"#VALUE!"},{"$error":"#N/A"},{"$error":"#N/A"},{"$error":"#N/A"},{"$error":"#N/A"},{"$error":"#VALUE!"},{"$error":"#VALUE!"},{"$error":"#N/A"},null,{"$error":"#VALUE!"},{"$error":"#N/A"},{"$error":"#N/A"},{"$error":"#N/A"},{"$error":"#N/A"},{"$error":"#VALUE!"},{"$error":"#VALUE!"},{"$error":"#N/A"},null,{"$error":"#VALUE!"},{"$error":"#N/A"},{"$error":"#N/A"},{"$error":"#N/A"},{"$error":"#N/A"},{"$error":"#VALUE!"},{"$error":"#VALUE!"},{"$error":"#N/A"},null,{"$error":"#VALUE!"},{"$error":"#N/A"},{"$error":"#N/A"},{"$error":"#N/A"},{"$error":"#N/A"},{"$error":"#VALUE!"},{"$error":"#VALUE!"},{"$error":"#N/A"},null,{"$error":"#VALUE!"},{"$error":"#N/A"},{"$error":"#N/A"},{"$error":"#N/A"},{"$error":"#N/A"},{"$error":"#VALUE!"},{"$error":"#VALUE!"},{"$error":"#N/A"},null,{"$error":"#VALUE!"},{"$error":"#N/A"},{"$error":"#N/A"},{"$error":"#N/A"},{"$error":"#N/A"},{"$error":"#VALUE!"},{"$error":"#VALUE!"},{"$error":"#N/A"}]
[2053,{"$error":"#VALUE!"},{"$error":"#N/A"},{"$error":"#VALUE!"},{"$error":"#N/A"},{"$error":"#N/A"},{"$error":"#VALUE!"},{"$error":"#VALUE!"},{"$error":"#N/A"},null,{"$error":"#VALUE!"},{"$error":"#N/A"},{"$error":"#N/A"},{"$error":"#N/A"},{"$error":"#N/A"},{"$error":"#VALUE!"},{"$error":"#VALUE!"},{"$error":"#N/A"},null,{"$error":"#VALUE!"},{"$error":"#N/A"},{"$error":"#N/A"},{"$error":"#N/A"},{"$error":"#N/A"},{"$error":"#VALUE!"},{"$error":"#VALUE!"},{"$error":"#N/A"},null,{"$error":"#VALUE!"},{"$error":"#N/A"},{"$error":"#N/A"},{"$error":"#N/A"},{"$error":"#N/A"},{"$error":"#VALUE!"},{"$error":"#VALUE!"},{"$error":"#N/A"},null,{"$error":"#VALUE!"},{"$error":"#N/A"},{"$error":"#N/A"},{"$error":"#N/A"},{"$error":"#N/A"},{"$error":"#VALUE!"},{"$error":"#VALUE!"},{"$error":"#N/A"},null,{"$error":"#VALUE!"},{"$error":"#N/A"},{"$error":"#N/A"},{"$error":"#N/A"},{"$error":"#N/A"},{"$error":"#VALUE!"},{"$error":"#VALUE!"},{"$error":"#N/A"},null,{"$error":"#VALUE!"},{"$error":"#N/A"},{"$error":"#N/A"},{"$error":"#N/A"},{"$error":"#N/A"},{"$error":"#VALUE!"},{"$error":"#VALUE!"},{"$error":"#N/A"},null,{"$error":"#VALUE!"},{"$error":"#N/A"},{"$error":"#N/A"},{"$error":"#N/A"},{"$error":"#N/A"},{"$error":"#VALUE!"},{"$error":"#VALUE!"},{"$error":"#N/A"},null,{"$error":"#VALUE!"},{"$error":"#N/A"},{"$error":"#N/A"},{"$error":"#N/A"},{"$error":"#N/A"},{"$error":"#VALUE!"},{"$error":"#VALUE!"},{"$error":"#N/A"},null,{"$error":"#VALUE!"},{"$error":"#N/A"},{"$error":"#N/A"},{"$error":"#N/A"},{"$error":"#N/A"},{"$error":"#VALUE!"},{"$error":"#VALUE!"},{"$error":"#N/A"},null,{"$error":"#VALUE!"},{"$error":"#N/A"},{"$error":"#N/A"},{"$error":"#N/A"},{"$error":"#N/A"},{"$error":"#VALUE!"},{"$error":"#VALUE!"},{"$error":"#N/A"},null,{"$error":"#VALUE!"},{"$error":"#N/A"},{"$error":"#N/A"},{"$error":"#N/A"},{"$error":"#N/A"},{"$error":"#VALUE!"},{"$error":"#VALUE!"},{"$error":"#N/A"}]
[{"$f":"A45+1","v":2054},{"$error":"#VALUE!"},{"$error":"#N/A"},{"$error":"#VALUE!"},{"$error":"#N/A"},{"$error":"#N/A"},{"$error":"#VALUE!"},{"$error":"#VALUE!"},{"$error":"#N/A"},null,{"$error":"#VALUE!"},{"$error":"#N/A"},{"$error":"#N/A"},{"$error":"#N/A"},{"$error":"#N/A"},{"$error":"#VALUE!"},{"$error":"#VALUE!"},{"$error":"#N/A"},null,{"$error":"#VALUE!"},{"$error":"#N/A"},{"$error":"#N/A"},{"$error":"#N/A"},{"$error":"#N/A"},{"$error":"#VALUE!"},{"$error":"#VALUE!"},{"$error":"#N/A"},null,{"$error":"#VALUE!"},{"$error":"#N/A"},{"$error":"#N/A"},{"$error":"#N/A"},{"$error":"#N/A"},{"$error":"#VALUE!"},{"$error":"#VALUE!"},{"$error":"#N/A"},null,{"$error":"#VALUE!"},{"$error":"#N/A"},{"$error":"#N/A"},{"$error":"#N/A"},{"$error":"#N/A"},{"$error":"#VALUE!"},{"$error":"#VALUE!"},{"$error":"#N/A"},null,{"$error":"#VALUE!"},{"$error":"#N/A"},{"$error":"#N/A"},{"$error":"#N/A"},{"$error":"#N/A"},{"$error":"#VALUE!"},{"$error":"#VALUE!"},{"$error":"#N/A"},null,{"$error":"#VALUE!"},{"$error":"#N/A"},{"$error":"#N/A"},{"$error":"#N/A"},{"$error":"#N/A"},{"$error":"#VALUE!"},{"$error":"#VALUE!"},{"$error":"#N/A"},null,{"$error":"#VALUE!"},{"$error":"#N/A"},{"$error":"#N/A"},{"$error":"#N/A"},{"$error":"#N/A"},{"$error":"#VALUE!"},{"$error":"#VALUE!"},{"$error":"#N/A"},null,{"$error":"#VALUE!"},{"$error":"#N/A"},{"$error":"#N/A"},{"$error":"#N/A"},{"$error":"#N/A"},{"$error":"#VALUE!"},{"$error":"#VALUE!"},{"$error":"#N/A"},null,{"$error":"#VALUE!"},{"$error":"#N/A"},{"$error":"#N/A"},{"$error":"#N/A"},{"$error":"#N/A"},{"$error":"#VALUE!"},{"$error":"#VALUE!"},{"$error":"#N/A"},null,{"$error":"#VALUE!"},{"$error":"#N/A"},{"$error":"#N/A"},{"$error":"#N/A"},{"$error":"#N/A"},{"$error":"#VALUE!"},{"$error":"#VALUE!"},{"$error":"#N/A"},null,{"$error":"#VALUE!"},{"$error":"#N/A"},{"$error":"#N/A"},{"$error":"#N/A"},{"$error":"#N/A"},{"$error":"#VALUE!"},{"$error":"#VALUE!"},{"$error":"#N/A"}]
[2055,{"$error":"#VALUE!"},{"$error":"#N/A"},{"$error":"#VALUE!"},{"$error":"#N/A"},{"$error":"#N/A"},{"$error":"#VALUE!"},{"$error":"#VALUE!"},{"$error":"#N/A"},null,{"$error":"#VALUE!"},{"$error":"#N/A"},{"$error":"#N/A"},{"$error":"#N/A"},{"$error":"#N/A"},{"$error":"#VALUE!"},{"$error":"#VALUE!"},{"$error":"#N/A"},null,{"$error":"#VALUE!"},{"$error":"#N/A"},{"$error":"#N/A"},{"$error":"#N/A"},{"$error":"#N/A"},{"$error":"#VALUE!"},{"$error":"#VALUE!"},{"$error":"#N/A"},null,{"$error":"#VALUE!"},{"$error":"#N/A"},{"$error":"#N/A"},{"$error":"#N/A"},{"$error":"#N/A"},{"$error":"#VALUE!"},{"$error":"#VALUE!"},{"$error":"#N/A"},null,{"$error":"#VALUE!"},{"$error":"#N/A"},{"$error":"#N/A"},{"$error":"#N/A"},{"$error":"#N/A"},{"$error":"#VALUE!"},{"$error":"#VALUE!"},{"$error":"#N/A"},null,{"$error":"#VALUE!"},{"$error":"#N/A"},{"$error":"#N/A"},{"$error":"#N/A"},{"$error":"#N/A"},{"$error":"#VALUE!"},{"$error":"#VALUE!"},{"$error":"#N/A"},null,{"$error":"#VALUE!"},{"$error":"#N/A"},{"$error":"#N/A"},{"$error":"#N/A"},{"$error":"#N/A"},{"$error":"#VALUE!"},{"$error":"#VALUE!"},{"$error":"#N/A"},null,{"$error":"#VALUE!"},{"$error":"#N/A"},{"$error":"#N/A"},{"$error":"#N/A"},{"$error":"#N/A"},{"$error":"#VALUE!"},{"$error":"#VALUE!"},{"$error":"#N/A"},null,{"$error":"#VALUE!"},{"$error":"#N/A"},{"$error":"#N/A"},{"$error":"#N/A"},{"$error":"#N/A"},{"$error":"#VALUE!"},{"$error":"#VALUE!"},{"$error":"#N/A"},null,{"$error":"#VALUE!"},{"$error":"#N/A"},{"$error":"#N/A"},{"$error":"#N/A"},{"$error":"#N/A"},{"$error":"#VALUE!"},{"$error":"#VALUE!"},{"$error":"#N/A"},null,{"$error":"#VALUE!"},{"$error":"#N/A"},{"$error":"#N/A"},{"$error":"#N/A"},{"$error":"#N/A"},{"$error":"#VALUE!"},{"$error":"#VALUE!"},{"$error":"#N/A"},null,{"$error":"#VALUE!"},{"$error":"#N/A"},{"$error":"#N/A"},{"$error":"#N/A"},{"$error":"#N/A"},{"$error":"#VALUE!"},{"$error":"#VALUE!"},{"$error":"#N/A"}]
[2056,{"$error":"#VALUE!"},{"$error":"#N/A"},{"$error":"#VALUE!"},{"$error":"#N/A"},{"$error":"#N/A"},{"$error":"#VALUE!"},{"$error":"#VALUE!"},{"$error":"#N/A"},null,{"$error":"#VALUE!"},{"$error":"#N/A"},{"$error":"#N/A"},{"$error":"#N/A"},{"$error":"#N/A"},{"$error":"#VALUE!"},{"$error":"#VALUE!"},{"$error":"#N/A"},null,{"$error":"#VALUE!"},{"$error":"#N/A"},{"$error":"#N/A"},{"$error":"#N/A"},{"$error":"#N/A"},{"$error":"#VALUE!"},{"$error":"#VALUE!"},{"$error":"#N/A"},null,{"$error":"#VALUE!"},{"$error":"#N/A"},{"$error":"#N/A"},{"$error":"#N/A"},{"$error":"#N/A"},{"$error":"#VALUE!"},{"$error":"#VALUE!"},{"$error":"#N/A"},null,{"$error":"#VALUE!"},{"$error":"#N/A"},{"$error":"#N/A"},{"$error":"#N/A"},{"$error":"#N/A"},{"$error":"#VALUE!"},{"$error":"#VALUE!"},{"$error":"#N/A"},null,{"$error":"#VALUE!"},{"$error":"#N/A"},{"$error":"#N/A"},{"$error":"#N/A"},{"$error":"#N/A"},{"$error":"#VALUE!"},{"$error":"#VALUE!"},{"$error":"#N/A"},null,{"$error":"#VALUE!"},{"$error":"#N/A"},{"$error":"#N/A"},{"$error":"#N/A"},{"$error":"#N/A"},{"$error":"#VALUE!"},{"$error":"#VALUE!"},{"$error":"#N/A"},null,{"$error":"#VALUE!"},{"$error":"#N/A"},{"$error":"#N/A"},{"$error":"#N/A"},{"$error":"#N/A"},{"$error":"#VALUE!"},{"$error":"#VALUE!"},{"$error":"#N/A"},null,{"$error":"#VALUE!"},{"$error":"#N/A"},{"$error":"#N/A"},{"$error":"#N/A"},{"$error":"#N/A"},{"$error":"#VALUE!"},{"$error":"#VALUE!"},{"$error":"#N/A"},null,{"$error":"#VALUE!"},{"$error":"#N/A"},{"$error":"#N/A"},{"$error":"#N/A"},{"$error":"#N/A"},{"$error":"#VALUE!"},{"$error":"#VALUE!"},{"$error":"#N/A"},null,{"$error":"#VALUE!"},{"$error":"#N/A"},{"$error":"#N/A"},{"$error":"#N/A"},{"$error":"#N/A"},{"$error":"#VALUE!"},{"$error":"#VALUE!"},{"$error":"#N/A"},null,{"$error":"#VALUE!"},{"$error":"#N/A"},{"$error":"#N/A"},{"$error":"#N/A"},{"$error":"#N/A"},{"$error":"#VALUE!"},{"$error":"#VALUE!"},{"$error":"#N/A"}]
[2057,{"$error":"#VALUE!"},{"$error":"#N/A"},{"$error":"#VALUE!"},{"$error":"#N/A"},{"$error":"#N/A"},{"$error":"#VALUE!"},{"$error":"#VALUE!"},{"$error":"#N/A"},null,{"$error":"#VALUE!"},{"$error":"#N/A"},{"$error":"#N/A"},{"$error":"#N/A"},{"$error":"#N/A"},{"$error":"#VALUE!"},{"$error":"#VALUE!"},{"$error":"#N/A"},null,{"$error":"#VALUE!"},{"$error":"#N/A"},{"$error":"#N/A"},{"$error":"#N/A"},{"$error":"#N/A"},{"$error":"#VALUE!"},{"$error":"#VALUE!"},{"$error":"#N/A"},null,{"$error":"#VALUE!"},{"$error":"#N/A"},{"$error":"#N/A"},{"$error":"#N/A"},{"$error":"#N/A"},{"$error":"#VALUE!"},{"$error":"#VALUE!"},{"$error":"#N/A"},null,{"$error":"#VALUE!"},{"$error":"#N/A"},{"$error":"#N/A"},{"$error":"#N/A"},{"$error":"#N/A"},{"$error":"#VALUE!"},{"$error":"#VALUE!"},{"$error":"#N/A"},null,{"$error":"#VALUE!"},{"$error":"#N/A"},{"$error":"#N/A"},{"$error":"#N/A"},{"$error":"#N/A"},{"$error":"#VALUE!"},{"$error":"#VALUE!"},{"$error":"#N/A"},null,{"$error":"#VALUE!"},{"$error":"#N/A"},{"$error":"#N/A"},{"$error":"#N/A"},{"$error":"#N/A"},{"$error":"#VALUE!"},{"$error":"#VALUE!"},{"$error":"#N/A"},null,{"$error":"#VALUE!"},{"$error":"#N/A"},{"$error":"#N/A"},{"$error":"#N/A"},{"$error":"#N/A"},{"$error":"#VALUE!"},{"$error":"#VALUE!"},{"$error":"#N/A"},null,{"$error":"#VALUE!"},{"$error":"#N/A"},{"$error":"#N/A"},{"$error":"#N/A"},{"$error":"#N/A"},{"$error":"#VALUE!"},{"$error":"#VALUE!"},{"$error":"#N/A"},null,{"$error":"#VALUE!"},{"$error":"#N/A"},{"$error":"#N/A"},{"$error":"#N/A"},{"$error":"#N/A"},{"$error":"#VALUE!"},{"$error":"#VALUE!"},{"$error":"#N/A"},null,{"$error":"#VALUE!"},{"$error":"#N/A"},{"$error":"#N/A"},{"$error":"#N/A"},{"$error":"#N/A"},{"$error":"#VALUE!"},{"$error":"#VALUE!"},{"$error":"#N/A"},null,{"$error":"#VALUE!"},{"$error":"#N/A"},{"$error":"#N/A"},{"$error":"#N/A"},{"$error":"#N/A"},{"$error":"#VALUE!"},{"$error":"#VALUE!"},{"$error":"#N/A"}]
[2058,{"$error":"#VALUE!"},{"$error":"#N/A"},{"$error":"#VALUE!"},{"$error":"#N/A"},{"$error":"#N/A"},{"$error":"#VALUE!"},{"$error":"#VALUE!"},{"$error":"#N/A"},null,{"$error":"#VALUE!"},{"$error":"#N/A"},{"$error":"#N/A"},{"$error":"#N/A"},{"$error":"#N/A"},{"$error":"#VALUE!"},{"$error":"#VALUE!"},{"$error":"#N/A"},null,{"$error":"#VALUE!"},{"$error":"#N/A"},{"$error":"#N/A"},{"$error":"#N/A"},{"$error":"#N/A"},{"$error":"#VALUE!"},{"$error":"#VALUE!"},{"$error":"#N/A"},null,{"$error":"#VALUE!"},{"$error":"#N/A"},{"$error":"#N/A"},{"$error":"#N/A"},{"$error":"#N/A"},{"$error":"#VALUE!"},{"$error":"#VALUE!"},{"$error":"#N/A"},null,{"$error":"#VALUE!"},{"$error":"#N/A"},{"$error":"#N/A"},{"$error":"#N/A"},{"$error":"#N/A"},{"$error":"#VALUE!"},{"$error":"#VALUE!"},{"$error":"#N/A"},null,{"$error":"#VALUE!"},{"$error":"#N/A"},{"$error":"#N/A"},{"$error":"#N/A"},{"$error":"#N/A"},{"$error":"#VALUE!"},{"$error":"#VALUE!"},{"$error":"#N/A"},null,{"$error":"#VALUE!"},{"$error":"#N/A"},{"$error":"#N/A"},{"$error":"#N/A"},{"$error":"#N/A"},{"$error":"#VALUE!"},{"$error":"#VALUE!"},{"$error":"#N/A"},null,{"$error":"#VALUE!"},{"$error":"#N/A"},{"$error":"#N/A"},{"$error":"#N/A"},{"$error":"#N/A"},{"$error":"#VALUE!"},{"$error":"#VALUE!"},{"$error":"#N/A"},null,{"$error":"#VALUE!"},{"$error":"#N/A"},{"$error":"#N/A"},{"$error":"#N/A"},{"$error":"#N/A"},{"$error":"#VALUE!"},{"$error":"#VALUE!"},{"$error":"#N/A"},null,{"$error":"#VALUE!"},{"$error":"#N/A"},{"$error":"#N/A"},{"$error":"#N/A"},{"$error":"#N/A"},{"$error":"#VALUE!"},{"$error":"#VALUE!"},{"$error":"#N/A"},null,{"$error":"#VALUE!"},{"$error":"#N/A"},{"$error":"#N/A"},{"$error":"#N/A"},{"$error":"#N/A"},{"$error":"#VALUE!"},{"$error":"#VALUE!"},{"$error":"#N/A"},null,{"$error":"#VALUE!"},{"$error":"#N/A"},{"$error":"#N/A"},{"$error":"#N/A"},{"$error":"#N/A"},{"$error":"#VALUE!"},{"$error":"#VALUE!"},{"$error":"#N/A"}]
[2059,{"$error":"#VALUE!"},{"$error":"#N/A"},{"$error":"#VALUE!"},{"$error":"#N/A"},{"$error":"#N/A"},{"$error":"#VALUE!"},{"$error":"#VALUE!"},{"$error":"#N/A"},null,{"$error":"#VALUE!"},{"$error":"#N/A"},{"$error":"#N/A"},{"$error":"#N/A"},{"$error":"#N/A"},{"$error":"#VALUE!"},{"$error":"#VALUE!"},{"$error":"#N/A"},null,{"$error":"#VALUE!"},{"$error":"#N/A"},{"$error":"#N/A"},{"$error":"#N/A"},{"$error":"#N/A"},{"$error":"#VALUE!"},{"$error":"#VALUE!"},{"$error":"#N/A"},null,{"$error":"#VALUE!"},{"$error":"#N/A"},{"$error":"#N/A"},{"$error":"#N/A"},{"$error":"#N/A"},{"$error":"#VALUE!"},{"$error":"#VALUE!"},{"$error":"#N/A"},null,{"$error":"#VALUE!"},{"$error":"#N/A"},{"$error":"#N/A"},{"$error":"#N/A"},{"$error":"#N/A"},{"$error":"#VALUE!"},{"$error":"#VALUE!"},{"$error":"#N/A"},null,{"$error":"#VALUE!"},{"$error":"#N/A"},{"$error":"#N/A"},{"$error":"#N/A"},{"$error":"#N/A"},{"$error":"#VALUE!"},{"$error":"#VALUE!"},{"$error":"#N/A"},null,{"$error":"#VALUE!"},{"$error":"#N/A"},{"$error":"#N/A"},{"$error":"#N/A"},{"$error":"#N/A"},{"$error":"#VALUE!"},{"$error":"#VALUE!"},{"$error":"#N/A"},null,{"$error":"#VALUE!"},{"$error":"#N/A"},{"$error":"#N/A"},{"$error":"#N/A"},{"$error":"#N/A"},{"$error":"#VALUE!"},{"$error":"#VALUE!"},{"$error":"#N/A"},null,{"$error":"#VALUE!"},{"$error":"#N/A"},{"$error":"#N/A"},{"$error":"#N/A"},{"$error":"#N/A"},{"$error":"#VALUE!"},{"$error":"#VALUE!"},{"$error":"#N/A"},null,{"$error":"#VALUE!"},{"$error":"#N/A"},{"$error":"#N/A"},{"$error":"#N/A"},{"$error":"#N/A"},{"$error":"#VALUE!"},{"$error":"#VALUE!"},{"$error":"#N/A"},null,{"$error":"#VALUE!"},{"$error":"#N/A"},{"$error":"#N/A"},{"$error":"#N/A"},{"$error":"#N/A"},{"$error":"#VALUE!"},{"$error":"#VALUE!"},{"$error":"#N/A"},null,{"$error":"#VALUE!"},{"$error":"#N/A"},{"$error":"#N/A"},{"$error":"#N/A"},{"$error":"#N/A"},{"$error":"#VALUE!"},{"$error":"#VALUE!"},{"$error":"#N/A"}]
[2060,{"$error":"#VALUE!"},{"$error":"#N/A"},{"$error":"#VALUE!"},{"$error":"#N/A"},{"$error":"#N/A"},{"$error":"#VALUE!"},{"$error":"#VALUE!"},{"$error":"#N/A"},null,{"$error":"#VALUE!"},{"$error":"#N/A"},{"$error":"#N/A"},{"$error":"#N/A"},{"$error":"#N/A"},{"$error":"#VALUE!"},{"$error":"#VALUE!"},{"$error":"#N/A"},null,{"$error":"#VALUE!"},{"$error":"#N/A"},{"$error":"#N/A"},{"$error":"#N/A"},{"$error":"#N/A"},{"$error":"#VALUE!"},{"$error":"#VALUE!"},{"$error":"#N/A"},null,{"$error":"#VALUE!"},{"$error":"#N/A"},{"$error":"#N/A"},{"$error":"#N/A"},{"$error":"#N/A"},{"$error":"#VALUE!"},{"$error":"#VALUE!"},{"$error":"#N/A"},null,{"$error":"#VALUE!"},{"$error":"#N/A"},{"$error":"#N/A"},{"$error":"#N/A"},{"$error":"#N/A"},{"$error":"#VALUE!"},{"$error":"#VALUE!"},{"$error":"#N/A"},null,{"$error":"#VALUE!"},{"$error":"#N/A"},{"$error":"#N/A"},{"$error":"#N/A"},{"$error":"#N/A"},{"$error":"#VALUE!"},{"$error":"#VALUE!"},{"$error":"#N/A"},null,{"$error":"#VALUE!"},{"$error":"#N/A"},{"$error":"#N/A"},{"$error":"#N/A"},{"$error":"#N/A"},{"$error":"#VALUE!"},{"$error":"#VALUE!"},{"$error":"#N/A"},null,{"$error":"#VALUE!"},{"$error":"#N/A"},{"$error":"#N/A"},{"$error":"#N/A"},{"$error":"#N/A"},{"$error":"#VALUE!"},{"$error":"#VALUE!"},{"$error":"#N/A"},null,{"$error":"#VALUE!"},{"$error":"#N/A"},{"$error":"#N/A"},{"$error":"#N/A"},{"$error":"#N/A"},{"$error":"#VALUE!"},{"$error":"#VALUE!"},{"$error":"#N/A"},null,{"$error":"#VALUE!"},{"$error":"#N/A"},{"$error":"#N/A"},{"$error":"#N/A"},{"$error":"#N/A"},{"$error":"#VALUE!"},{"$error":"#VALUE!"},{"$error":"#N/A"},null,{"$error":"#VALUE!"},{"$error":"#N/A"},{"$error":"#N/A"},{"$error":"#N/A"},{"$error":"#N/A"},{"$error":"#VALUE!"},{"$error":"#VALUE!"},{"$error":"#N/A"},null,{"$error":"#VALUE!"},{"$error":"#N/A"},{"$error":"#N/A"},{"$error":"#N/A"},{"$error":"#N/A"},{"$error":"#VALUE!"},{"$error":"#VALUE!"},{"$error":"#N/A"}]
[2061,{"$error":"#VALUE!"},{"$error":"#N/A"},{"$error":"#VALUE!"},{"$error":"#N/A"},{"$error":"#N/A"},{"$error":"#VALUE!"},{"$error":"#VALUE!"},{"$error":"#N/A"},null,{"$error":"#VALUE!"},{"$error":"#N/A"},{"$error":"#N/A"},{"$error":"#N/A"},{"$error":"#N/A"},{"$error":"#VALUE!"},{"$error":"#VALUE!"},{"$error":"#N/A"},null,{"$error":"#VALUE!"},{"$error":"#N/A"},{"$error":"#N/A"},{"$error":"#N/A"},{"$error":"#N/A"},{"$error":"#VALUE!"},{"$error":"#VALUE!"},{"$error":"#N/A"},null,{"$error":"#VALUE!"},{"$error":"#N/A"},{"$error":"#N/A"},{"$error":"#N/A"},{"$error":"#N/A"},{"$error":"#VALUE!"},{"$error":"#VALUE!"},{"$error":"#N/A"},null,{"$error":"#VALUE!"},{"$error":"#N/A"},{"$error":"#N/A"},{"$error":"#N/A"},{"$error":"#N/A"},{"$error":"#VALUE!"},{"$error":"#VALUE!"},{"$error":"#N/A"},null,{"$error":"#VALUE!"},{"$error":"#N/A"},{"$error":"#N/A"},{"$error":"#N/A"},{"$error":"#N/A"},{"$error":"#VALUE!"},{"$error":"#VALUE!"},{"$error":"#N/A"},null,{"$error":"#VALUE!"},{"$error":"#N/A"},{"$error":"#N/A"},{"$error":"#N/A"},{"$error":"#N/A"},{"$error":"#VALUE!"},{"$error":"#VALUE!"},{"$error":"#N/A"},null,{"$error":"#VALUE!"},{"$error":"#N/A"},{"$error":"#N/A"},{"$error":"#N/A"},{"$error":"#N/A"},{"$error":"#VALUE!"},{"$error":"#VALUE!"},{"$error":"#N/A"},null,{"$error":"#VALUE!"},{"$error":"#N/A"},{"$error":"#N/A"},{"$error":"#N/A"},{"$error":"#N/A"},{"$error":"#VALUE!"},{"$error":"#VALUE!"},{"$error":"#N/A"},null,{"$error":"#VALUE!"},{"$error":"#N/A"},{"$error":"#N/A"},{"$error":"#N/A"},{"$error":"#N/A"},{"$error":"#VALUE!"},{"$error":"#VALUE!"},{"$error":"#N/A"},null,{"$error":"#VALUE!"},{"$error":"#N/A"},{"$error":"#N/A"},{"$error":"#N/A"},{"$error":"#N/A"},{"$error":"#VALUE!"},{"$error":"#VALUE!"},{"$error":"#N/A"},null,{"$error":"#VALUE!"},{"$error":"#N/A"},{"$error":"#N/A"},{"$error":"#N/A"},{"$error":"#N/A"},{"$error":"#VALUE!"},{"$error":"#VALUE!"},{"$error":"#N/A"}]
[2062,{"$error":"#VALUE!"},{"$error":"#N/A"},{"$error":"#VALUE!"},{"$error":"#N/A"},{"$error":"#N/A"},{"$error":"#VALUE!"},{"$error":"#VALUE!"},{"$error":"#N/A"},null,{"$error":"#VALUE!"},{"$error":"#N/A"},{"$error":"#N/A"},{"$error":"#N/A"},{"$error":"#N/A"},{"$error":"#VALUE!"},{"$error":"#VALUE!"},{"$error":"#N/A"},null,{"$error":"#VALUE!"},{"$error":"#N/A"},{"$error":"#N/A"},{"$error":"#N/A"},{"$error":"#N/A"},{"$error":"#VALUE!"},{"$error":"#VALUE!"},{"$error":"#N/A"},null,{"$error":"#VALUE!"},{"$error":"#N/A"},{"$error":"#N/A"},{"$error":"#N/A"},{"$error":"#N/A"},{"$error":"#VALUE!"},{"$error":"#VALUE!"},{"$error":"#N/A"},null,{"$error":"#VALUE!"},{"$error":"#N/A"},{"$error":"#N/A"},{"$error":"#N/A"},{"$error":"#N/A"},{"$error":"#VALUE!"},{"$error":"#VALUE!"},{"$error":"#N/A"},null,{"$error":"#VALUE!"},{"$error":"#N/A"},{"$error":"#N/A"},{"$error":"#N/A"},{"$error":"#N/A"},{"$error":"#VALUE!"},{"$error":"#VALUE!"},{"$error":"#N/A"},null,{"$error":"#VALUE!"},{"$error":"#N/A"},{"$error":"#N/A"},{"$error":"#N/A"},{"$error":"#N/A"},{"$error":"#VALUE!"},{"$error":"#VALUE!"},{"$error":"#N/A"},null,{"$error":"#VALUE!"},{"$error":"#N/A"},{"$error":"#N/A"},{"$error":"#N/A"},{"$error":"#N/A"},{"$error":"#VALUE!"},{"$error":"#VALUE!"},{"$error":"#N/A"},null,{"$error":"#VALUE!"},{"$error":"#N/A"},{"$error":"#N/A"},{"$error":"#N/A"},{"$error":"#N/A"},{"$error":"#VALUE!"},{"$error":"#VALUE!"},{"$error":"#N/A"},null,{"$error":"#VALUE!"},{"$error":"#N/A"},{"$error":"#N/A"},{"$error":"#N/A"},{"$error":"#N/A"},{"$error":"#VALUE!"},{"$error":"#VALUE!"},{"$error":"#N/A"},null,{"$error":"#VALUE!"},{"$error":"#N/A"},{"$error":"#N/A"},{"$error":"#N/A"},{"$error":"#N/A"},{"$error":"#VALUE!"},{"$error":"#VALUE!"},{"$error":"#N/A"},null,{"$error":"#VALUE!"},{"$error":"#N/A"},{"$error":"#N/A"},{"$error":"#N/A"},{"$error":"#N/A"},{"$error":"#VALUE!"},{"$error":"#VALUE!"},{"$error":"#N/A"}]
[2063,{"$error":"#VALUE!"},{"$error":"#N/A"},{"$error":"#VALUE!"},{"$error":"#N/A"},{"$error":"#N/A"},{"$error":"#VALUE!"},{"$error":"#VALUE!"},{"$error":"#N/A"},null,{"$error":"#VALUE!"},{"$error":"#N/A"},{"$error":"#N/A"},{"$error":"#N/A"},{"$error":"#N/A"},{"$error":"#VALUE!"},{"$error":"#VALUE!"},{"$error":"#N/A"},null,{"$error":"#VALUE!"},{"$error":"#N/A"},{"$error":"#N/A"},{"$error":"#N/A"},{"$error":"#N/A"},{"$error":"#VALUE!"},{"$error":"#VALUE!"},{"$error":"#N/A"},null,{"$error":"#VALUE!"},{"$error":"#N/A"},{"$error":"#N/A"},{"$error":"#N/A"},{"$error":"#N/A"},{"$error":"#VALUE!"},{"$error":"#VALUE!"},{"$error":"#N/A"},null,{"$error":"#VALUE!"},{"$error":"#N/A"},{"$error":"#N/A"},{"$error":"#N/A"},{"$error":"#N/A"},{"$error":"#VALUE!"},{"$error":"#VALUE!"},{"$error":"#N/A"},null,{"$error":"#VALUE!"},{"$error":"#N/A"},{"$error":"#N/A"},{"$error":"#N/A"},{"$error":"#N/A"},{"$error":"#VALUE!"},{"$error":"#VALUE!"},{"$error":"#N/A"},null,{"$error":"#VALUE!"},{"$error":"#N/A"},{"$error":"#N/A"},{"$error":"#N/A"},{"$error":"#N/A"},{"$error":"#VALUE!"},{"$error":"#VALUE!"},{"$error":"#N/A"},null,{"$error":"#VALUE!"},{"$error":"#N/A"},{"$error":"#N/A"},{"$error":"#N/A"},{"$error":"#N/A"},{"$error":"#VALUE!"},{"$error":"#VALUE!"},{"$error":"#N/A"},null,{"$error":"#VALUE!"},{"$error":"#N/A"},{"$error":"#N/A"},{"$error":"#N/A"},{"$error":"#N/A"},{"$error":"#VALUE!"},{"$error":"#VALUE!"},{"$error":"#N/A"},null,{"$error":"#VALUE!"},{"$error":"#N/A"},{"$error":"#N/A"},{"$error":"#N/A"},{"$error":"#N/A"},{"$error":"#VALUE!"},{"$error":"#VALUE!"},{"$error":"#N/A"},null,{"$error":"#VALUE!"},{"$error":"#N/A"},{"$error":"#N/A"},{"$error":"#N/A"},{"$error":"#N/A"},{"$error":"#VALUE!"},{"$error":"#VALUE!"},{"$error":"#N/A"},null,{"$error":"#VALUE!"},{"$error":"#N/A"},{"$error":"#N/A"},{"$error":"#N/A"},{"$error":"#N/A"},{"$error":"#VALUE!"},{"$error":"#VALUE!"},{"$error":"#N/A"}]
[2064,{"$error":"#VALUE!"},{"$error":"#N/A"},{"$error":"#VALUE!"},{"$error":"#N/A"},{"$error":"#N/A"},{"$error":"#VALUE!"},{"$error":"#VALUE!"},{"$error":"#N/A"},null,{"$error":"#VALUE!"},{"$error":"#N/A"},{"$error":"#N/A"},{"$error":"#N/A"},{"$error":"#N/A"},{"$error":"#VALUE!"},{"$error":"#VALUE!"},{"$error":"#N/A"},null,{"$error":"#VALUE!"},{"$error":"#N/A"},{"$error":"#N/A"},{"$error":"#N/A"},{"$error":"#N/A"},{"$error":"#VALUE!"},{"$error":"#VALUE!"},{"$error":"#N/A"},null,{"$error":"#VALUE!"},{"$error":"#N/A"},{"$error":"#N/A"},{"$error":"#N/A"},{"$error":"#N/A"},{"$error":"#VALUE!"},{"$error":"#VALUE!"},{"$error":"#N/A"},null,{"$error":"#VALUE!"},{"$error":"#N/A"},{"$error":"#N/A"},{"$error":"#N/A"},{"$error":"#N/A"},{"$error":"#VALUE!"},{"$error":"#VALUE!"},{"$error":"#N/A"},null,{"$error":"#VALUE!"},{"$error":"#N/A"},{"$error":"#N/A"},{"$error":"#N/A"},{"$error":"#N/A"},{"$error":"#VALUE!"},{"$error":"#VALUE!"},{"$error":"#N/A"},null,{"$error":"#VALUE!"},{"$error":"#N/A"},{"$error":"#N/A"},{"$error":"#N/A"},{"$error":"#N/A"},{"$error":"#VALUE!"},{"$error":"#VALUE!"},{"$error":"#N/A"},null,{"$error":"#VALUE!"},{"$error":"#N/A"},{"$error":"#N/A"},{"$error":"#N/A"},{"$error":"#N/A"},{"$error":"#VALUE!"},{"$error":"#VALUE!"},{"$error":"#N/A"},null,{"$error":"#VALUE!"},{"$error":"#N/A"},{"$error":"#N/A"},{"$error":"#N/A"},{"$error":"#N/A"},{"$error":"#VALUE!"},{"$error":"#VALUE!"},{"$error":"#N/A"},null,{"$error":"#VALUE!"},{"$error":"#N/A"},{"$error":"#N/A"},{"$error":"#N/A"},{"$error":"#N/A"},{"$error":"#VALUE!"},{"$error":"#VALUE!"},{"$error":"#N/A"},null,{"$error":"#VALUE!"},{"$error":"#N/A"},{"$error":"#N/A"},{"$error":"#N/A"},{"$error":"#N/A"},{"$error":"#VALUE!"},{"$error":"#VALUE!"},{"$error":"#N/A"},null,{"$error":"#VALUE!"},{"$error":"#N/A"},{"$error":"#N/A"},{"$error":"#N/A"},{"$error":"#N/A"},{"$error":"#VALUE!"},{"$error":"#VALUE!"},{"$error":"#N/A"}]
[2065,{"$error":"#VALUE!"},{"$error":"#N/A"},{"$error":"#VALUE!"},{"$error":"#N/A"},{"$error":"#N/A"},{"$error":"#VALUE!"},{"$error":"#VALUE!"},{"$error":"#N/A"},null,{"$error":"#VALUE!"},{"$error":"#N/A"},{"$error":"#N/A"},{"$error":"#N/A"},{"$error":"#N/A"},{"$error":"#VALUE!"},{"$error":"#VALUE!"},{"$error":"#N/A"},null,{"$error":"#VALUE!"},{"$error":"#N/A"},{"$error":"#N/A"},{"$error":"#N/A"},{"$error":"#N/A"},{"$error":"#VALUE!"},{"$error":"#VALUE!"},{"$error":"#N/A"},null,{"$error":"#VALUE!"},{"$error":"#N/A"},{"$error":"#N/A"},{"$error":"#N/A"},{"$error":"#N/A"},{"$error":"#VALUE!"},{"$error":"#VALUE!"},{"$error":"#N/A"},null,{"$error":"#VALUE!"},{"$error":"#N/A"},{"$error":"#N/A"},{"$error":"#N/A"},{"$error":"#N/A"},{"$error":"#VALUE!"},{"$error":"#VALUE!"},{"$error":"#N/A"},null,{"$error":"#VALUE!"},{"$error":"#N/A"},{"$error":"#N/A"},{"$error":"#N/A"},{"$error":"#N/A"},{"$error":"#VALUE!"},{"$error":"#VALUE!"},{"$error":"#N/A"},null,{"$error":"#VALUE!"},{"$error":"#N/A"},{"$error":"#N/A"},{"$error":"#N/A"},{"$error":"#N/A"},{"$error":"#VALUE!"},{"$error":"#VALUE!"},{"$error":"#N/A"},null,{"$error":"#VALUE!"},{"$error":"#N/A"},{"$error":"#N/A"},{"$error":"#N/A"},{"$error":"#N/A"},{"$error":"#VALUE!"},{"$error":"#VALUE!"},{"$error":"#N/A"},null,{"$error":"#VALUE!"},{"$error":"#N/A"},{"$error":"#N/A"},{"$error":"#N/A"},{"$error":"#N/A"},{"$error":"#VALUE!"},{"$error":"#VALUE!"},{"$error":"#N/A"},null,{"$error":"#VALUE!"},{"$error":"#N/A"},{"$error":"#N/A"},{"$error":"#N/A"},{"$error":"#N/A"},{"$error":"#VALUE!"},{"$error":"#VALUE!"},{"$error":"#N/A"},null,{"$error":"#VALUE!"},{"$error":"#N/A"},{"$error":"#N/A"},{"$error":"#N/A"},{"$error":"#N/A"},{"$error":"#VALUE!"},{"$error":"#VALUE!"},{"$error":"#N/A"},null,{"$error":"#VALUE!"},{"$error":"#N/A"},{"$error":"#N/A"},{"$error":"#N/A"},{"$error":"#N/A"},{"$error":"#VALUE!"},{"$error":"#VALUE!"},{"$error":"#N/A"}]
[2066,{"$error":"#VALUE!"},{"$error":"#N/A"},{"$error":"#VALUE!"},{"$error":"#N/A"},{"$error":"#N/A"},{"$error":"#VALUE!"},{"$error":"#VALUE!"},{"$error":"#N/A"},null,{"$error":"#VALUE!"},{"$error":"#N/A"},{"$error":"#N/A"},{"$error":"#N/A"},{"$error":"#N/A"},{"$error":"#VALUE!"},{"$error":"#VALUE!"},{"$error":"#N/A"},null,{"$error":"#VALUE!"},{"$error":"#N/A"},{"$error":"#N/A"},{"$error":"#N/A"},{"$error":"#N/A"},{"$error":"#VALUE!"},{"$error":"#VALUE!"},{"$error":"#N/A"},null,{"$error":"#VALUE!"},{"$error":"#N/A"},{"$error":"#N/A"},{"$error":"#N/A"},{"$error":"#N/A"},{"$error":"#VALUE!"},{"$error":"#VALUE!"},{"$error":"#N/A"},null,{"$error":"#VALUE!"},{"$error":"#N/A"},{"$error":"#N/A"},{"$error":"#N/A"},{"$error":"#N/A"},{"$error":"#VALUE!"},{"$error":"#VALUE!"},{"$error":"#N/A"},null,{"$error":"#VALUE!"},{"$error":"#N/A"},{"$error":"#N/A"},{"$error":"#N/A"},{"$error":"#N/A"},{"$error":"#VALUE!"},{"$error":"#VALUE!"},{"$error":"#N/A"},null,{"$error":"#VALUE!"},{"$error":"#N/A"},{"$error":"#N/A"},{"$error":"#N/A"},{"$error":"#N/A"},{"$error":"#VALUE!"},{"$error":"#VALUE!"},{"$error":"#N/A"},null,{"$error":"#VALUE!"},{"$error":"#N/A"},{"$error":"#N/A"},{"$error":"#N/A"},{"$error":"#N/A"},{"$error":"#VALUE!"},{"$error":"#VALUE!"},{"$error":"#N/A"},null,{"$error":"#VALUE!"},{"$error":"#N/A"},{"$error":"#N/A"},{"$error":"#N/A"},{"$error":"#N/A"},{"$error":"#VALUE!"},{"$error":"#VALUE!"},{"$error":"#N/A"},null,{"$error":"#VALUE!"},{"$error":"#N/A"},{"$error":"#N/A"},{"$error":"#N/A"},{"$error":"#N/A"},{"$error":"#VALUE!"},{"$error":"#VALUE!"},{"$error":"#N/A"},null,{"$error":"#VALUE!"},{"$error":"#N/A"},{"$error":"#N/A"},{"$error":"#N/A"},{"$error":"#N/A"},{"$error":"#VALUE!"},{"$error":"#VALUE!"},{"$error":"#N/A"},null,{"$error":"#VALUE!"},{"$error":"#N/A"},{"$error":"#N/A"},{"$error":"#N/A"},{"$error":"#N/A"},{"$error":"#VALUE!"},{"$error":"#VALUE!"},{"$error":"#N/A"}]
[2067,{"$error":"#VALUE!"},{"$error":"#N/A"},{"$error":"#VALUE!"},{"$error":"#N/A"},{"$error":"#N/A"},{"$error":"#VALUE!"},{"$error":"#VALUE!"},{"$error":"#N/A"},null,{"$error":"#VALUE!"},{"$error":"#N/A"},{"$error":"#N/A"},{"$error":"#N/A"},{"$error":"#N/A"},{"$error":"#VALUE!"},{"$error":"#VALUE!"},{"$error":"#N/A"},null,{"$error":"#VALUE!"},{"$error":"#N/A"},{"$error":"#N/A"},{"$error":"#N/A"},{"$error":"#N/A"},{"$error":"#VALUE!"},{"$error":"#VALUE!"},{"$error":"#N/A"},null,{"$error":"#VALUE!"},{"$error":"#N/A"},{"$error":"#N/A"},{"$error":"#N/A"},{"$error":"#N/A"},{"$error":"#VALUE!"},{"$error":"#VALUE!"},{"$error":"#N/A"},null,{"$error":"#VALUE!"},{"$error":"#N/A"},{"$error":"#N/A"},{"$error":"#N/A"},{"$error":"#N/A"},{"$error":"#VALUE!"},{"$error":"#VALUE!"},{"$error":"#N/A"},null,{"$error":"#VALUE!"},{"$error":"#N/A"},{"$error":"#N/A"},{"$error":"#N/A"},{"$error":"#N/A"},{"$error":"#VALUE!"},{"$error":"#VALUE!"},{"$error":"#N/A"},null,{"$error":"#VALUE!"},{"$error":"#N/A"},{"$error":"#N/A"},{"$error":"#N/A"},{"$error":"#N/A"},{"$error":"#VALUE!"},{"$error":"#VALUE!"},{"$error":"#N/A"},null,{"$error":"#VALUE!"},{"$error":"#N/A"},{"$error":"#N/A"},{"$error":"#N/A"},{"$error":"#N/A"},{"$error":"#VALUE!"},{"$error":"#VALUE!"},{"$error":"#N/A"},null,{"$error":"#VALUE!"},{"$error":"#N/A"},{"$error":"#N/A"},{"$error":"#N/A"},{"$error":"#N/A"},{"$error":"#VALUE!"},{"$error":"#VALUE!"},{"$error":"#N/A"},null,{"$error":"#VALUE!"},{"$error":"#N/A"},{"$error":"#N/A"},{"$error":"#N/A"},{"$error":"#N/A"},{"$error":"#VALUE!"},{"$error":"#VALUE!"},{"$error":"#N/A"},null,{"$error":"#VALUE!"},{"$error":"#N/A"},{"$error":"#N/A"},{"$error":"#N/A"},{"$error":"#N/A"},{"$error":"#VALUE!"},{"$error":"#VALUE!"},{"$error":"#N/A"},null,{"$error":"#VALUE!"},{"$error":"#N/A"},{"$error":"#N/A"},{"$error":"#N/A"},{"$error":"#N/A"},{"$error":"#VALUE!"},{"$error":"#VALUE!"},{"$error":"#N/A"}]
[2068,{"$error":"#VALUE!"},{"$error":"#N/A"},{"$error":"#VALUE!"},{"$error":"#N/A"},{"$error":"#N/A"},{"$error":"#VALUE!"},{"$error":"#VALUE!"},{"$error":"#N/A"},null,{"$error":"#VALUE!"},{"$error":"#N/A"},{"$error":"#N/A"},{"$error":"#N/A"},{"$error":"#N/A"},{"$error":"#VALUE!"},{"$error":"#VALUE!"},{"$error":"#N/A"},null,{"$error":"#VALUE!"},{"$error":"#N/A"},{"$error":"#N/A"},{"$error":"#N/A"},{"$error":"#N/A"},{"$error":"#VALUE!"},{"$error":"#VALUE!"},{"$error":"#N/A"},null,{"$error":"#VALUE!"},{"$error":"#N/A"},{"$error":"#N/A"},{"$error":"#N/A"},{"$error":"#N/A"},{"$error":"#VALUE!"},{"$error":"#VALUE!"},{"$error":"#N/A"},null,{"$error":"#VALUE!"},{"$error":"#N/A"},{"$error":"#N/A"},{"$error":"#N/A"},{"$error":"#N/A"},{"$error":"#VALUE!"},{"$error":"#VALUE!"},{"$error":"#N/A"},null,{"$error":"#VALUE!"},{"$error":"#N/A"},{"$error":"#N/A"},{"$error":"#N/A"},{"$error":"#N/A"},{"$error":"#VALUE!"},{"$error":"#VALUE!"},{"$error":"#N/A"},null,{"$error":"#VALUE!"},{"$error":"#N/A"},{"$error":"#N/A"},{"$error":"#N/A"},{"$error":"#N/A"},{"$error":"#VALUE!"},{"$error":"#VALUE!"},{"$error":"#N/A"},null,{"$error":"#VALUE!"},{"$error":"#N/A"},{"$error":"#N/A"},{"$error":"#N/A"},{"$error":"#N/A"},{"$error":"#VALUE!"},{"$error":"#VALUE!"},{"$error":"#N/A"},null,{"$error":"#VALUE!"},{"$error":"#N/A"},{"$error":"#N/A"},{"$error":"#N/A"},{"$error":"#N/A"},{"$error":"#VALUE!"},{"$error":"#VALUE!"},{"$error":"#N/A"},null,{"$error":"#VALUE!"},{"$error":"#N/A"},{"$error":"#N/A"},{"$error":"#N/A"},{"$error":"#N/A"},{"$error":"#VALUE!"},{"$error":"#VALUE!"},{"$error":"#N/A"},null,{"$error":"#VALUE!"},{"$error":"#N/A"},{"$error":"#N/A"},{"$error":"#N/A"},{"$error":"#N/A"},{"$error":"#VALUE!"},{"$error":"#VALUE!"},{"$error":"#N/A"},null,{"$error":"#VALUE!"},{"$error":"#N/A"},{"$error":"#N/A"},{"$error":"#N/A"},{"$error":"#N/A"},{"$error":"#VALUE!"},{"$error":"#VALUE!"},{"$error":"#N/A"}]
[2069,{"$error":"#VALUE!"},{"$error":"#N/A"},{"$error":"#VALUE!"},{"$error":"#N/A"},{"$error":"#N/A"},{"$error":"#VALUE!"},{"$error":"#VALUE!"},{"$error":"#N/A"},null,{"$error":"#VALUE!"},{"$error":"#N/A"},{"$error":"#N/A"},{"$error":"#N/A"},{"$error":"#N/A"},{"$error":"#VALUE!"},{"$error":"#VALUE!"},{"$error":"#N/A"},null,{"$error":"#VALUE!"},{"$error":"#N/A"},{"$error":"#N/A"},{"$error":"#N/A"},{"$error":"#N/A"},{"$error":"#VALUE!"},{"$error":"#VALUE!"},{"$error":"#N/A"},null,{"$error":"#VALUE!"},{"$error":"#N/A"},{"$error":"#N/A"},{"$error":"#N/A"},{"$error":"#N/A"},{"$error":"#VALUE!"},{"$error":"#VALUE!"},{"$error":"#N/A"},null,{"$error":"#VALUE!"},{"$error":"#N/A"},{"$error":"#N/A"},{"$error":"#N/A"},{"$error":"#N/A"},{"$error":"#VALUE!"},{"$error":"#VALUE!"},{"$error":"#N/A"},null,{"$error":"#VALUE!"},{"$error":"#N/A"},{"$error":"#N/A"},{"$error":"#N/A"},{"$error":"#N/A"},{"$error":"#VALUE!"},{"$error":"#VALUE!"},{"$error":"#N/A"},null,{"$error":"#VALUE!"},{"$error":"#N/A"},{"$error":"#N/A"},{"$error":"#N/A"},{"$error":"#N/A"},{"$error":"#VALUE!"},{"$error":"#VALUE!"},{"$error":"#N/A"},null,{"$error":"#VALUE!"},{"$error":"#N/A"},{"$error":"#N/A"},{"$error":"#N/A"},{"$error":"#N/A"},{"$error":"#VALUE!"},{"$error":"#VALUE!"},{"$error":"#N/A"},null,{"$error":"#VALUE!"},{"$error":"#N/A"},{"$error":"#N/A"},{"$error":"#N/A"},{"$error":"#N/A"},{"$error":"#VALUE!"},{"$error":"#VALUE!"},{"$error":"#N/A"},null,{"$error":"#VALUE!"},{"$error":"#N/A"},{"$error":"#N/A"},{"$error":"#N/A"},{"$error":"#N/A"},{"$error":"#VALUE!"},{"$error":"#VALUE!"},{"$error":"#N/A"},null,{"$error":"#VALUE!"},{"$error":"#N/A"},{"$error":"#N/A"},{"$error":"#N/A"},{"$error":"#N/A"},{"$error":"#VALUE!"},{"$error":"#VALUE!"},{"$error":"#N/A"},null,{"$error":"#VALUE!"},{"$error":"#N/A"},{"$error":"#N/A"},{"$error":"#N/A"},{"$error":"#N/A"},{"$error":"#VALUE!"},{"$error":"#VALUE!"},{"$error":"#N/A"}]
[{"$f":"A61+1","v":2070},{"$error":"#VALUE!"},{"$error":"#N/A"},{"$error":"#VALUE!"},{"$error":"#N/A"},{"$error":"#N/A"},{"$error":"#VALUE!"},{"$error":"#VALUE!"},{"$error":"#N/A"},null,{"$error":"#VALUE!"},{"$error":"#N/A"},{"$error":"#N/A"},{"$error":"#N/A"},{"$error":"#N/A"},{"$error":"#VALUE!"},{"$error":"#VALUE!"},{"$error":"#N/A"},null,{"$error":"#VALUE!"},{"$error":"#N/A"},{"$error":"#N/A"},{"$error":"#N/A"},{"$error":"#N/A"},{"$error":"#VALUE!"},{"$error":"#VALUE!"},{"$error":"#N/A"},null,{"$error":"#VALUE!"},{"$error":"#N/A"},{"$error":"#N/A"},{"$error":"#N/A"},{"$error":"#N/A"},{"$error":"#VALUE!"},{"$error":"#VALUE!"},{"$error":"#N/A"},null,{"$error":"#VALUE!"},{"$error":"#N/A"},{"$error":"#N/A"},{"$error":"#N/A"},{"$error":"#N/A"},{"$error":"#VALUE!"},{"$error":"#VALUE!"},{"$error":"#N/A"},null,{"$error":"#VALUE!"},{"$error":"#N/A"},{"$error":"#N/A"},{"$error":"#N/A"},{"$error":"#N/A"},{"$error":"#VALUE!"},{"$error":"#VALUE!"},{"$error":"#N/A"},null,{"$error":"#VALUE!"},{"$error":"#N/A"},{"$error":"#N/A"},{"$error":"#N/A"},{"$error":"#N/A"},{"$error":"#VALUE!"},{"$error":"#VALUE!"},{"$error":"#N/A"},null,{"$error":"#VALUE!"},{"$error":"#N/A"},{"$error":"#N/A"},{"$error":"#N/A"},{"$error":"#N/A"},{"$error":"#VALUE!"},{"$error":"#VALUE!"},{"$error":"#N/A"},null,{"$error":"#VALUE!"},{"$error":"#N/A"},{"$error":"#N/A"},{"$error":"#N/A"},{"$error":"#N/A"},{"$error":"#VALUE!"},{"$error":"#VALUE!"},{"$error":"#N/A"},null,{"$error":"#VALUE!"},{"$error":"#N/A"},{"$error":"#N/A"},{"$error":"#N/A"},{"$error":"#N/A"},{"$error":"#VALUE!"},{"$error":"#VALUE!"},{"$error":"#N/A"},null,{"$error":"#VALUE!"},{"$error":"#N/A"},{"$error":"#N/A"},{"$error":"#N/A"},{"$error":"#N/A"},{"$error":"#VALUE!"},{"$error":"#VALUE!"},{"$error":"#N/A"},null,{"$error":"#VALUE!"},{"$error":"#N/A"},{"$error":"#N/A"},{"$error":"#N/A"},{"$error":"#N/A"},{"$error":"#VALUE!"},{"$error":"#VALUE!"},{"$error":"#N/A"}]
[2071,{"$error":"#VALUE!"},{"$error":"#N/A"},{"$error":"#VALUE!"},{"$error":"#N/A"},{"$error":"#N/A"},{"$error":"#VALUE!"},{"$error":"#VALUE!"},{"$error":"#N/A"},null,{"$error":"#VALUE!"},{"$error":"#N/A"},{"$error":"#N/A"},{"$error":"#N/A"},{"$error":"#N/A"},{"$error":"#VALUE!"},{"$error":"#VALUE!"},{"$error":"#N/A"},null,{"$error":"#VALUE!"},{"$error":"#N/A"},{"$error":"#N/A"},{"$error":"#N/A"},{"$error":"#N/A"},{"$error":"#VALUE!"},{"$error":"#VALUE!"},{"$error":"#N/A"},null,{"$error":"#VALUE!"},{"$error":"#N/A"},{"$error":"#N/A"},{"$error":"#N/A"},{"$error":"#N/A"},{"$error":"#VALUE!"},{"$error":"#VALUE!"},{"$error":"#N/A"},null,{"$error":"#VALUE!"},{"$error":"#N/A"},{"$error":"#N/A"},{"$error":"#N/A"},{"$error":"#N/A"},{"$error":"#VALUE!"},{"$error":"#VALUE!"},{"$error":"#N/A"},null,{"$error":"#VALUE!"},{"$error":"#N/A"},{"$error":"#N/A"},{"$error":"#N/A"},{"$error":"#N/A"},{"$error":"#VALUE!"},{"$error":"#VALUE!"},{"$error":"#N/A"},null,{"$error":"#VALUE!"},{"$error":"#N/A"},{"$error":"#N/A"},{"$error":"#N/A"},{"$error":"#N/A"},{"$error":"#VALUE!"},{"$error":"#VALUE!"},{"$error":"#N/A"},null,{"$error":"#VALUE!"},{"$error":"#N/A"},{"$error":"#N/A"},{"$error":"#N/A"},{"$error":"#N/A"},{"$error":"#VALUE!"},{"$error":"#VALUE!"},{"$error":"#N/A"},null,{"$error":"#VALUE!"},{"$error":"#N/A"},{"$error":"#N/A"},{"$error":"#N/A"},{"$error":"#N/A"},{"$error":"#VALUE!"},{"$error":"#VALUE!"},{"$error":"#N/A"},null,{"$error":"#VALUE!"},{"$error":"#N/A"},{"$error":"#N/A"},{"$error":"#N/A"},{"$error":"#N/A"},{"$error":"#VALUE!"},{"$error":"#VALUE!"},{"$error":"#N/A"},null,{"$error":"#VALUE!"},{"$error":"#N/A"},{"$error":"#N/A"},{"$error":"#N/A"},{"$error":"#N/A"},{"$error":"#VALUE!"},{"$error":"#VALUE!"},{"$error":"#N/A"},null,{"$error":"#VALUE!"},{"$error":"#N/A"},{"$error":"#N/A"},{"$error":"#N/A"},{"$error":"#N/A"},{"$error":"#VALUE!"},{"$error":"#VALUE!"},{"$error":"#N/A"}]
[2072,{"$error":"#VALUE!"},{"$error":"#N/A"},{"$error":"#VALUE!"},{"$error":"#N/A"},{"$error":"#N/A"},{"$error":"#VALUE!"},{"$error":"#VALUE!"},{"$error":"#N/A"},null,{"$error":"#VALUE!"},{"$error":"#N/A"},{"$error":"#N/A"},{"$error":"#N/A"},{"$error":"#N/A"},{"$error":"#VALUE!"},{"$error":"#VALUE!"},{"$error":"#N/A"},null,{"$error":"#VALUE!"},{"$error":"#N/A"},{"$error":"#N/A"},{"$error":"#N/A"},{"$error":"#N/A"},{"$error":"#VALUE!"},{"$error":"#VALUE!"},{"$error":"#N/A"},null,{"$error":"#VALUE!"},{"$error":"#N/A"},{"$error":"#N/A"},{"$error":"#N/A"},{"$error":"#N/A"},{"$error":"#VALUE!"},{"$error":"#VALUE!"},{"$error":"#N/A"},null,{"$error":"#VALUE!"},{"$error":"#N/A"},{"$error":"#N/A"},{"$error":"#N/A"},{"$error":"#N/A"},{"$error":"#VALUE!"},{"$error":"#VALUE!"},{"$error":"#N/A"},null,{"$error":"#VALUE!"},{"$error":"#N/A"},{"$error":"#N/A"},{"$error":"#N/A"},{"$error":"#N/A"},{"$error":"#VALUE!"},{"$error":"#VALUE!"},{"$error":"#N/A"},null,{"$error":"#VALUE!"},{"$error":"#N/A"},{"$error":"#N/A"},{"$error":"#N/A"},{"$error":"#N/A"},{"$error":"#VALUE!"},{"$error":"#VALUE!"},{"$error":"#N/A"},null,{"$error":"#VALUE!"},{"$error":"#N/A"},{"$error":"#N/A"},{"$error":"#N/A"},{"$error":"#N/A"},{"$error":"#VALUE!"},{"$error":"#VALUE!"},{"$error":"#N/A"},null,{"$error":"#VALUE!"},{"$error":"#N/A"},{"$error":"#N/A"},{"$error":"#N/A"},{"$error":"#N/A"},{"$error":"#VALUE!"},{"$error":"#VALUE!"},{"$error":"#N/A"},null,{"$error":"#VALUE!"},{"$error":"#N/A"},{"$error":"#N/A"},{"$error":"#N/A"},{"$error":"#N/A"},{"$error":"#VALUE!"},{"$error":"#VALUE!"},{"$error":"#N/A"},null,{"$error":"#VALUE!"},{"$error":"#N/A"},{"$error":"#N/A"},{"$error":"#N/A"},{"$error":"#N/A"},{"$error":"#VALUE!"},{"$error":"#VALUE!"},{"$error":"#N/A"},null,{"$error":"#VALUE!"},{"$error":"#N/A"},{"$error":"#N/A"},{"$error":"#N/A"},{"$error":"#N/A"},{"$error":"#VALUE!"},{"$error":"#VALUE!"},{"$error":"#N/A"}]
[2073,{"$error":"#VALUE!"},{"$error":"#N/A"},{"$error":"#VALUE!"},{"$error":"#N/A"},{"$error":"#N/A"},{"$error":"#VALUE!"},{"$error":"#VALUE!"},{"$error":"#N/A"},null,{"$error":"#VALUE!"},{"$error":"#N/A"},{"$error":"#N/A"},{"$error":"#N/A"},{"$error":"#N/A"},{"$error":"#VALUE!"},{"$error":"#VALUE!"},{"$error":"#N/A"},null,{"$error":"#VALUE!"},{"$error":"#N/A"},{"$error":"#N/A"},{"$error":"#N/A"},{"$error":"#N/A"},{"$error":"#VALUE!"},{"$error":"#VALUE!"},{"$error":"#N/A"},null,{"$error":"#VALUE!"},{"$error":"#N/A"},{"$error":"#N/A"},{"$error":"#N/A"},{"$error":"#N/A"},{"$error":"#VALUE!"},{"$error":"#VALUE!"},{"$error":"#N/A"},null,{"$error":"#VALUE!"},{"$error":"#N/A"},{"$error":"#N/A"},{"$error":"#N/A"},{"$error":"#N/A"},{"$error":"#VALUE!"},{"$error":"#VALUE!"},{"$error":"#N/A"},null,{"$error":"#VALUE!"},{"$error":"#N/A"},{"$error":"#N/A"},{"$error":"#N/A"},{"$error":"#N/A"},{"$error":"#VALUE!"},{"$error":"#VALUE!"},{"$error":"#N/A"},null,{"$error":"#VALUE!"},{"$error":"#N/A"},{"$error":"#N/A"},{"$error":"#N/A"},{"$error":"#N/A"},{"$error":"#VALUE!"},{"$error":"#VALUE!"},{"$error":"#N/A"},null,{"$error":"#VALUE!"},{"$error":"#N/A"},{"$error":"#N/A"},{"$error":"#N/A"},{"$error":"#N/A"},{"$error":"#VALUE!"},{"$error":"#VALUE!"},{"$error":"#N/A"},null,{"$error":"#VALUE!"},{"$error":"#N/A"},{"$error":"#N/A"},{"$error":"#N/A"},{"$error":"#N/A"},{"$error":"#VALUE!"},{"$error":"#VALUE!"},{"$error":"#N/A"},null,{"$error":"#VALUE!"},{"$error":"#N/A"},{"$error":"#N/A"},{"$error":"#N/A"},{"$error":"#N/A"},{"$error":"#VALUE!"},{"$error":"#VALUE!"},{"$error":"#N/A"},null,{"$error":"#VALUE!"},{"$error":"#N/A"},{"$error":"#N/A"},{"$error":"#N/A"},{"$error":"#N/A"},{"$error":"#VALUE!"},{"$error":"#VALUE!"},{"$error":"#N/A"},null,{"$error":"#VALUE!"},{"$error":"#N/A"},{"$error":"#N/A"},{"$error":"#N/A"},{"$error":"#N/A"},{"$error":"#VALUE!"},{"$error":"#VALUE!"},{"$error":"#N/A"}]
[2074,{"$error":"#VALUE!"},{"$error":"#N/A"},{"$error":"#VALUE!"},{"$error":"#N/A"},{"$error":"#N/A"},{"$error":"#VALUE!"},{"$error":"#VALUE!"},{"$error":"#N/A"},null,{"$error":"#VALUE!"},{"$error":"#N/A"},{"$error":"#N/A"},{"$error":"#N/A"},{"$error":"#N/A"},{"$error":"#VALUE!"},{"$error":"#VALUE!"},{"$error":"#N/A"},null,{"$error":"#VALUE!"},{"$error":"#N/A"},{"$error":"#N/A"},{"$error":"#N/A"},{"$error":"#N/A"},{"$error":"#VALUE!"},{"$error":"#VALUE!"},{"$error":"#N/A"},null,{"$error":"#VALUE!"},{"$error":"#N/A"},{"$error":"#N/A"},{"$error":"#N/A"},{"$error":"#N/A"},{"$error":"#VALUE!"},{"$error":"#VALUE!"},{"$error":"#N/A"},null,{"$error":"#VALUE!"},{"$error":"#N/A"},{"$error":"#N/A"},{"$error":"#N/A"},{"$error":"#N/A"},{"$error":"#VALUE!"},{"$error":"#VALUE!"},{"$error":"#N/A"},null,{"$error":"#VALUE!"},{"$error":"#N/A"},{"$error":"#N/A"},{"$error":"#N/A"},{"$error":"#N/A"},{"$error":"#VALUE!"},{"$error":"#VALUE!"},{"$error":"#N/A"},null,{"$error":"#VALUE!"},{"$error":"#N/A"},{"$error":"#N/A"},{"$error":"#N/A"},{"$error":"#N/A"},{"$error":"#VALUE!"},{"$error":"#VALUE!"},{"$error":"#N/A"},null,{"$error":"#VALUE!"},{"$error":"#N/A"},{"$error":"#N/A"},{"$error":"#N/A"},{"$error":"#N/A"},{"$error":"#VALUE!"},{"$error":"#VALUE!"},{"$error":"#N/A"},null,{"$error":"#VALUE!"},{"$error":"#N/A"},{"$error":"#N/A"},{"$error":"#N/A"},{"$error":"#N/A"},{"$error":"#VALUE!"},{"$error":"#VALUE!"},{"$error":"#N/A"},null,{"$error":"#VALUE!"},{"$error":"#N/A"},{"$error":"#N/A"},{"$error":"#N/A"},{"$error":"#N/A"},{"$error":"#VALUE!"},{"$error":"#VALUE!"},{"$error":"#N/A"},null,{"$error":"#VALUE!"},{"$error":"#N/A"},{"$error":"#N/A"},{"$error":"#N/A"},{"$error":"#N/A"},{"$error":"#VALUE!"},{"$error":"#VALUE!"},{"$error":"#N/A"},null,{"$error":"#VALUE!"},{"$error":"#N/A"},{"$error":"#N/A"},{"$error":"#N/A"},{"$error":"#N/A"},{"$error":"#VALUE!"},{"$error":"#VALUE!"},{"$error":"#N/A"}]
[2075,{"$error":"#VALUE!"},{"$error":"#N/A"},{"$error":"#VALUE!"},{"$error":"#N/A"},{"$error":"#N/A"},{"$error":"#VALUE!"},{"$error":"#VALUE!"},{"$error":"#N/A"},null,{"$error":"#VALUE!"},{"$error":"#N/A"},{"$error":"#N/A"},{"$error":"#N/A"},{"$error":"#N/A"},{"$error":"#VALUE!"},{"$error":"#VALUE!"},{"$error":"#N/A"},null,{"$error":"#VALUE!"},{"$error":"#N/A"},{"$error":"#N/A"},{"$error":"#N/A"},{"$error":"#N/A"},{"$error":"#VALUE!"},{"$error":"#VALUE!"},{"$error":"#N/A"},null,{"$error":"#VALUE!"},{"$error":"#N/A"},{"$error":"#N/A"},{"$error":"#N/A"},{"$error":"#N/A"},{"$error":"#VALUE!"},{"$error":"#VALUE!"},{"$error":"#N/A"},null,{"$error":"#VALUE!"},{"$error":"#N/A"},{"$error":"#N/A"},{"$error":"#N/A"},{"$error":"#N/A"},{"$error":"#VALUE!"},{"$error":"#VALUE!"},{"$error":"#N/A"},null,{"$error":"#VALUE!"},{"$error":"#N/A"},{"$error":"#N/A"},{"$error":"#N/A"},{"$error":"#N/A"},{"$error":"#VALUE!"},{"$error":"#VALUE!"},{"$error":"#N/A"},null,{"$error":"#VALUE!"},{"$error":"#N/A"},{"$error":"#N/A"},{"$error":"#N/A"},{"$error":"#N/A"},{"$error":"#VALUE!"},{"$error":"#VALUE!"},{"$error":"#N/A"},null,{"$error":"#VALUE!"},{"$error":"#N/A"},{"$error":"#N/A"},{"$error":"#N/A"},{"$error":"#N/A"},{"$error":"#VALUE!"},{"$error":"#VALUE!"},{"$error":"#N/A"},null,{"$error":"#VALUE!"},{"$error":"#N/A"},{"$error":"#N/A"},{"$error":"#N/A"},{"$error":"#N/A"},{"$error":"#VALUE!"},{"$error":"#VALUE!"},{"$error":"#N/A"},null,{"$error":"#VALUE!"},{"$error":"#N/A"},{"$error":"#N/A"},{"$error":"#N/A"},{"$error":"#N/A"},{"$error":"#VALUE!"},{"$error":"#VALUE!"},{"$error":"#N/A"},null,{"$error":"#VALUE!"},{"$error":"#N/A"},{"$error":"#N/A"},{"$error":"#N/A"},{"$error":"#N/A"},{"$error":"#VALUE!"},{"$error":"#VALUE!"},{"$error":"#N/A"},null,{"$error":"#VALUE!"},{"$error":"#N/A"},{"$error":"#N/A"},{"$error":"#N/A"},{"$error":"#N/A"},{"$error":"#VALUE!"},{"$error":"#VALUE!"},{"$error":"#N/A"}]
[2076,{"$error":"#VALUE!"},{"$error":"#N/A"},{"$error":"#VALUE!"},{"$error":"#N/A"},{"$error":"#N/A"},{"$error":"#VALUE!"},{"$error":"#VALUE!"},{"$error":"#N/A"},null,{"$error":"#VALUE!"},{"$error":"#N/A"},{"$error":"#N/A"},{"$error":"#N/A"},{"$error":"#N/A"},{"$error":"#VALUE!"},{"$error":"#VALUE!"},{"$error":"#N/A"},null,{"$error":"#VALUE!"},{"$error":"#N/A"},{"$error":"#N/A"},{"$error":"#N/A"},{"$error":"#N/A"},{"$error":"#VALUE!"},{"$error":"#VALUE!"},{"$error":"#N/A"},null,{"$error":"#VALUE!"},{"$error":"#N/A"},{"$error":"#N/A"},{"$error":"#N/A"},{"$error":"#N/A"},{"$error":"#VALUE!"},{"$error":"#VALUE!"},{"$error":"#N/A"},null,{"$error":"#VALUE!"},{"$error":"#N/A"},{"$error":"#N/A"},{"$error":"#N/A"},{"$error":"#N/A"},{"$error":"#VALUE!"},{"$error":"#VALUE!"},{"$error":"#N/A"},null,{"$error":"#VALUE!"},{"$error":"#N/A"},{"$error":"#N/A"},{"$error":"#N/A"},{"$error":"#N/A"},{"$error":"#VALUE!"},{"$error":"#VALUE!"},{"$error":"#N/A"},null,{"$error":"#VALUE!"},{"$error":"#N/A"},{"$error":"#N/A"},{"$error":"#N/A"},{"$error":"#N/A"},{"$error":"#VALUE!"},{"$error":"#VALUE!"},{"$error":"#N/A"},null,{"$error":"#VALUE!"},{"$error":"#N/A"},{"$error":"#N/A"},{"$error":"#N/A"},{"$error":"#N/A"},{"$error":"#VALUE!"},{"$error":"#VALUE!"},{"$error":"#N/A"},null,{"$error":"#VALUE!"},{"$error":"#N/A"},{"$error":"#N/A"},{"$error":"#N/A"},{"$error":"#N/A"},{"$error":"#VALUE!"},{"$error":"#VALUE!"},{"$error":"#N/A"},null,{"$error":"#VALUE!"},{"$error":"#N/A"},{"$error":"#N/A"},{"$error":"#N/A"},{"$error":"#N/A"},{"$error":"#VALUE!"},{"$error":"#VALUE!"},{"$error":"#N/A"},null,{"$error":"#VALUE!"},{"$error":"#N/A"},{"$error":"#N/A"},{"$error":"#N/A"},{"$error":"#N/A"},{"$error":"#VALUE!"},{"$error":"#VALUE!"},{"$error":"#N/A"},null,{"$error":"#VALUE!"},{"$error":"#N/A"},{"$error":"#N/A"},{"$error":"#N/A"},{"$error":"#N/A"},{"$error":"#VALUE!"},{"$error":"#VALUE!"},{"$error":"#N/A"}]
[2077,{"$error":"#VALUE!"},{"$error":"#N/A"},{"$error":"#VALUE!"},{"$error":"#N/A"},{"$error":"#N/A"},{"$error":"#VALUE!"},{"$error":"#VALUE!"},{"$error":"#N/A"},null,{"$error":"#VALUE!"},{"$error":"#N/A"},{"$error":"#N/A"},{"$error":"#N/A"},{"$error":"#N/A"},{"$error":"#VALUE!"},{"$error":"#VALUE!"},{"$error":"#N/A"},null,{"$error":"#VALUE!"},{"$error":"#N/A"},{"$error":"#N/A"},{"$error":"#N/A"},{"$error":"#N/A"},{"$error":"#VALUE!"},{"$error":"#VALUE!"},{"$error":"#N/A"},null,{"$error":"#VALUE!"},{"$error":"#N/A"},{"$error":"#N/A"},{"$error":"#N/A"},{"$error":"#N/A"},{"$error":"#VALUE!"},{"$error":"#VALUE!"},{"$error":"#N/A"},null,{"$error":"#VALUE!"},{"$error":"#N/A"},{"$error":"#N/A"},{"$error":"#N/A"},{"$error":"#N/A"},{"$error":"#VALUE!"},{"$error":"#VALUE!"},{"$error":"#N/A"},null,{"$error":"#VALUE!"},{"$error":"#N/A"},{"$error":"#N/A"},{"$error":"#N/A"},{"$error":"#N/A"},{"$error":"#VALUE!"},{"$error":"#VALUE!"},{"$error":"#N/A"},null,{"$error":"#VALUE!"},{"$error":"#N/A"},{"$error":"#N/A"},{"$error":"#N/A"},{"$error":"#N/A"},{"$error":"#VALUE!"},{"$error":"#VALUE!"},{"$error":"#N/A"},null,{"$error":"#VALUE!"},{"$error":"#N/A"},{"$error":"#N/A"},{"$error":"#N/A"},{"$error":"#N/A"},{"$error":"#VALUE!"},{"$error":"#VALUE!"},{"$error":"#N/A"},null,{"$error":"#VALUE!"},{"$error":"#N/A"},{"$error":"#N/A"},{"$error":"#N/A"},{"$error":"#N/A"},{"$error":"#VALUE!"},{"$error":"#VALUE!"},{"$error":"#N/A"},null,{"$error":"#VALUE!"},{"$error":"#N/A"},{"$error":"#N/A"},{"$error":"#N/A"},{"$error":"#N/A"},{"$error":"#VALUE!"},{"$error":"#VALUE!"},{"$error":"#N/A"},null,{"$error":"#VALUE!"},{"$error":"#N/A"},{"$error":"#N/A"},{"$error":"#N/A"},{"$error":"#N/A"},{"$error":"#VALUE!"},{"$error":"#VALUE!"},{"$error":"#N/A"},null,{"$error":"#VALUE!"},{"$error":"#N/A"},{"$error":"#N/A"},{"$error":"#N/A"},{"$error":"#N/A"},{"$error":"#VALUE!"},{"$error":"#VALUE!"},{"$error":"#N/A"}]
[2078,{"$error":"#VALUE!"},{"$error":"#N/A"},{"$error":"#VALUE!"},{"$error":"#N/A"},{"$error":"#N/A"},{"$error":"#VALUE!"},{"$error":"#VALUE!"},{"$error":"#N/A"},null,{"$error":"#VALUE!"},{"$error":"#N/A"},{"$error":"#N/A"},{"$error":"#N/A"},{"$error":"#N/A"},{"$error":"#VALUE!"},{"$error":"#VALUE!"},{"$error":"#N/A"},null,{"$error":"#VALUE!"},{"$error":"#N/A"},{"$error":"#N/A"},{"$error":"#N/A"},{"$error":"#N/A"},{"$error":"#VALUE!"},{"$error":"#VALUE!"},{"$error":"#N/A"},null,{"$error":"#VALUE!"},{"$error":"#N/A"},{"$error":"#N/A"},{"$error":"#N/A"},{"$error":"#N/A"},{"$error":"#VALUE!"},{"$error":"#VALUE!"},{"$error":"#N/A"},null,{"$error":"#VALUE!"},{"$error":"#N/A"},{"$error":"#N/A"},{"$error":"#N/A"},{"$error":"#N/A"},{"$error":"#VALUE!"},{"$error":"#VALUE!"},{"$error":"#N/A"},null,{"$error":"#VALUE!"},{"$error":"#N/A"},{"$error":"#N/A"},{"$error":"#N/A"},{"$error":"#N/A"},{"$error":"#VALUE!"},{"$error":"#VALUE!"},{"$error":"#N/A"},null,{"$error":"#VALUE!"},{"$error":"#N/A"},{"$error":"#N/A"},{"$error":"#N/A"},{"$error":"#N/A"},{"$error":"#VALUE!"},{"$error":"#VALUE!"},{"$error":"#N/A"},null,{"$error":"#VALUE!"},{"$error":"#N/A"},{"$error":"#N/A"},{"$error":"#N/A"},{"$error":"#N/A"},{"$error":"#VALUE!"},{"$error":"#VALUE!"},{"$error":"#N/A"},null,{"$error":"#VALUE!"},{"$error":"#N/A"},{"$error":"#N/A"},{"$error":"#N/A"},{"$error":"#N/A"},{"$error":"#VALUE!"},{"$error":"#VALUE!"},{"$error":"#N/A"},null,{"$error":"#VALUE!"},{"$error":"#N/A"},{"$error":"#N/A"},{"$error":"#N/A"},{"$error":"#N/A"},{"$error":"#VALUE!"},{"$error":"#VALUE!"},{"$error":"#N/A"},null,{"$error":"#VALUE!"},{"$error":"#N/A"},{"$error":"#N/A"},{"$error":"#N/A"},{"$error":"#N/A"},{"$error":"#VALUE!"},{"$error":"#VALUE!"},{"$error":"#N/A"},null,{"$error":"#VALUE!"},{"$error":"#N/A"},{"$error":"#N/A"},{"$error":"#N/A"},{"$error":"#N/A"},{"$error":"#VALUE!"},{"$error":"#VALUE!"},{"$error":"#N/A"}]
[2079,{"$error":"#VALUE!"},{"$error":"#N/A"},{"$error":"#VALUE!"},{"$error":"#N/A"},{"$error":"#N/A"},{"$error":"#VALUE!"},{"$error":"#VALUE!"},{"$error":"#N/A"},null,{"$error":"#VALUE!"},{"$error":"#N/A"},{"$error":"#N/A"},{"$error":"#N/A"},{"$error":"#N/A"},{"$error":"#VALUE!"},{"$error":"#VALUE!"},{"$error":"#N/A"},null,{"$error":"#VALUE!"},{"$error":"#N/A"},{"$error":"#N/A"},{"$error":"#N/A"},{"$error":"#N/A"},{"$error":"#VALUE!"},{"$error":"#VALUE!"},{"$error":"#N/A"},null,{"$error":"#VALUE!"},{"$error":"#N/A"},{"$error":"#N/A"},{"$error":"#N/A"},{"$error":"#N/A"},{"$error":"#VALUE!"},{"$error":"#VALUE!"},{"$error":"#N/A"},null,{"$error":"#VALUE!"},{"$error":"#N/A"},{"$error":"#N/A"},{"$error":"#N/A"},{"$error":"#N/A"},{"$error":"#VALUE!"},{"$error":"#VALUE!"},{"$error":"#N/A"},null,{"$error":"#VALUE!"},{"$error":"#N/A"},{"$error":"#N/A"},{"$error":"#N/A"},{"$error":"#N/A"},{"$error":"#VALUE!"},{"$error":"#VALUE!"},{"$error":"#N/A"},null,{"$error":"#VALUE!"},{"$error":"#N/A"},{"$error":"#N/A"},{"$error":"#N/A"},{"$error":"#N/A"},{"$error":"#VALUE!"},{"$error":"#VALUE!"},{"$error":"#N/A"},null,{"$error":"#VALUE!"},{"$error":"#N/A"},{"$error":"#N/A"},{"$error":"#N/A"},{"$error":"#N/A"},{"$error":"#VALUE!"},{"$error":"#VALUE!"},{"$error":"#N/A"},null,{"$error":"#VALUE!"},{"$error":"#N/A"},{"$error":"#N/A"},{"$error":"#N/A"},{"$error":"#N/A"},{"$error":"#VALUE!"},{"$error":"#VALUE!"},{"$error":"#N/A"},null,{"$error":"#VALUE!"},{"$error":"#N/A"},{"$error":"#N/A"},{"$error":"#N/A"},{"$error":"#N/A"},{"$error":"#VALUE!"},{"$error":"#VALUE!"},{"$error":"#N/A"},null,{"$error":"#VALUE!"},{"$error":"#N/A"},{"$error":"#N/A"},{"$error":"#N/A"},{"$error":"#N/A"},{"$error":"#VALUE!"},{"$error":"#VALUE!"},{"$error":"#N/A"},null,{"$error":"#VALUE!"},{"$error":"#N/A"},{"$error":"#N/A"},{"$error":"#N/A"},{"$error":"#N/A"},{"$error":"#VALUE!"},{"$error":"#VALUE!"},{"$error":"#N/A"}]
[2080,{"$error":"#VALUE!"},{"$error":"#N/A"},{"$error":"#VALUE!"},{"$error":"#N/A"},{"$error":"#N/A"},{"$error":"#VALUE!"},{"$error":"#VALUE!"},{"$error":"#N/A"},null,{"$error":"#VALUE!"},{"$error":"#N/A"},{"$error":"#N/A"},{"$error":"#N/A"},{"$error":"#N/A"},{"$error":"#VALUE!"},{"$error":"#VALUE!"},{"$error":"#N/A"},null,{"$error":"#VALUE!"},{"$error":"#N/A"},{"$error":"#N/A"},{"$error":"#N/A"},{"$error":"#N/A"},{"$error":"#VALUE!"},{"$error":"#VALUE!"},{"$error":"#N/A"},null,{"$error":"#VALUE!"},{"$error":"#N/A"},{"$error":"#N/A"},{"$error":"#N/A"},{"$error":"#N/A"},{"$error":"#VALUE!"},{"$error":"#VALUE!"},{"$error":"#N/A"},null,{"$error":"#VALUE!"},{"$error":"#N/A"},{"$error":"#N/A"},{"$error":"#N/A"},{"$error":"#N/A"},{"$error":"#VALUE!"},{"$error":"#VALUE!"},{"$error":"#N/A"},null,{"$error":"#VALUE!"},{"$error":"#N/A"},{"$error":"#N/A"},{"$error":"#N/A"},{"$error":"#N/A"},{"$error":"#VALUE!"},{"$error":"#VALUE!"},{"$error":"#N/A"},null,{"$error":"#VALUE!"},{"$error":"#N/A"},{"$error":"#N/A"},{"$error":"#N/A"},{"$error":"#N/A"},{"$error":"#VALUE!"},{"$error":"#VALUE!"},{"$error":"#N/A"},null,{"$error":"#VALUE!"},{"$error":"#N/A"},{"$error":"#N/A"},{"$error":"#N/A"},{"$error":"#N/A"},{"$error":"#VALUE!"},{"$error":"#VALUE!"},{"$error":"#N/A"},null,{"$error":"#VALUE!"},{"$error":"#N/A"},{"$error":"#N/A"},{"$error":"#N/A"},{"$error":"#N/A"},{"$error":"#VALUE!"},{"$error":"#VALUE!"},{"$error":"#N/A"},null,{"$error":"#VALUE!"},{"$error":"#N/A"},{"$error":"#N/A"},{"$error":"#N/A"},{"$error":"#N/A"},{"$error":"#VALUE!"},{"$error":"#VALUE!"},{"$error":"#N/A"},null,{"$error":"#VALUE!"},{"$error":"#N/A"},{"$error":"#N/A"},{"$error":"#N/A"},{"$error":"#N/A"},{"$error":"#VALUE!"},{"$error":"#VALUE!"},{"$error":"#N/A"},null,{"$error":"#VALUE!"},{"$error":"#N/A"},{"$error":"#N/A"},{"$error":"#N/A"},{"$error":"#N/A"},{"$error":"#VALUE!"},{"$error":"#VALUE!"},{"$error":"#N/A"}]
[2081,{"$error":"#VALUE!"},{"$error":"#N/A"},{"$error":"#VALUE!"},{"$error":"#N/A"},{"$error":"#N/A"},{"$error":"#VALUE!"},{"$error":"#VALUE!"},{"$error":"#N/A"},null,{"$error":"#VALUE!"},{"$error":"#N/A"},{"$error":"#N/A"},{"$error":"#N/A"},{"$error":"#N/A"},{"$error":"#VALUE!"},{"$error":"#VALUE!"},{"$error":"#N/A"},null,{"$error":"#VALUE!"},{"$error":"#N/A"},{"$error":"#N/A"},{"$error":"#N/A"},{"$error":"#N/A"},{"$error":"#VALUE!"},{"$error":"#VALUE!"},{"$error":"#N/A"},null,{"$error":"#VALUE!"},{"$error":"#N/A"},{"$error":"#N/A"},{"$error":"#N/A"},{"$error":"#N/A"},{"$error":"#VALUE!"},{"$error":"#VALUE!"},{"$error":"#N/A"},null,{"$error":"#VALUE!"},{"$error":"#N/A"},{"$error":"#N/A"},{"$error":"#N/A"},{"$error":"#N/A"},{"$error":"#VALUE!"},{"$error":"#VALUE!"},{"$error":"#N/A"},null,{"$error":"#VALUE!"},{"$error":"#N/A"},{"$error":"#N/A"},{"$error":"#N/A"},{"$error":"#N/A"},{"$error":"#VALUE!"},{"$error":"#VALUE!"},{"$error":"#N/A"},null,{"$error":"#VALUE!"},{"$error":"#N/A"},{"$error":"#N/A"},{"$error":"#N/A"},{"$error":"#N/A"},{"$error":"#VALUE!"},{"$error":"#VALUE!"},{"$error":"#N/A"},null,{"$error":"#VALUE!"},{"$error":"#N/A"},{"$error":"#N/A"},{"$error":"#N/A"},{"$error":"#N/A"},{"$error":"#VALUE!"},{"$error":"#VALUE!"},{"$error":"#N/A"},null,{"$error":"#VALUE!"},{"$error":"#N/A"},{"$error":"#N/A"},{"$error":"#N/A"},{"$error":"#N/A"},{"$error":"#VALUE!"},{"$error":"#VALUE!"},{"$error":"#N/A"},null,{"$error":"#VALUE!"},{"$error":"#N/A"},{"$error":"#N/A"},{"$error":"#N/A"},{"$error":"#N/A"},{"$error":"#VALUE!"},{"$error":"#VALUE!"},{"$error":"#N/A"},null,{"$error":"#VALUE!"},{"$error":"#N/A"},{"$error":"#N/A"},{"$error":"#N/A"},{"$error":"#N/A"},{"$error":"#VALUE!"},{"$error":"#VALUE!"},{"$error":"#N/A"},null,{"$error":"#VALUE!"},{"$error":"#N/A"},{"$error":"#N/A"},{"$error":"#N/A"},{"$error":"#N/A"},{"$error":"#VALUE!"},{"$error":"#VALUE!"},{"$error":"#N/A"}]
[2082,{"$error":"#VALUE!"},{"$error":"#N/A"},{"$error":"#VALUE!"},{"$error":"#N/A"},{"$error":"#N/A"},{"$error":"#VALUE!"},{"$error":"#VALUE!"},{"$error":"#N/A"},null,{"$error":"#VALUE!"},{"$error":"#N/A"},{"$error":"#N/A"},{"$error":"#N/A"},{"$error":"#N/A"},{"$error":"#VALUE!"},{"$error":"#VALUE!"},{"$error":"#N/A"},null,{"$error":"#VALUE!"},{"$error":"#N/A"},{"$error":"#N/A"},{"$error":"#N/A"},{"$error":"#N/A"},{"$error":"#VALUE!"},{"$error":"#VALUE!"},{"$error":"#N/A"},null,{"$error":"#VALUE!"},{"$error":"#N/A"},{"$error":"#N/A"},{"$error":"#N/A"},{"$error":"#N/A"},{"$error":"#VALUE!"},{"$error":"#VALUE!"},{"$error":"#N/A"},null,{"$error":"#VALUE!"},{"$error":"#N/A"},{"$error":"#N/A"},{"$error":"#N/A"},{"$error":"#N/A"},{"$error":"#VALUE!"},{"$error":"#VALUE!"},{"$error":"#N/A"},null,{"$error":"#VALUE!"},{"$error":"#N/A"},{"$error":"#N/A"},{"$error":"#N/A"},{"$error":"#N/A"},{"$error":"#VALUE!"},{"$error":"#VALUE!"},{"$error":"#N/A"},null,{"$error":"#VALUE!"},{"$error":"#N/A"},{"$error":"#N/A"},{"$error":"#N/A"},{"$error":"#N/A"},{"$error":"#VALUE!"},{"$error":"#VALUE!"},{"$error":"#N/A"},null,{"$error":"#VALUE!"},{"$error":"#N/A"},{"$error":"#N/A"},{"$error":"#N/A"},{"$error":"#N/A"},{"$error":"#VALUE!"},{"$error":"#VALUE!"},{"$error":"#N/A"},null,{"$error":"#VALUE!"},{"$error":"#N/A"},{"$error":"#N/A"},{"$error":"#N/A"},{"$error":"#N/A"},{"$error":"#VALUE!"},{"$error":"#VALUE!"},{"$error":"#N/A"},null,{"$error":"#VALUE!"},{"$error":"#N/A"},{"$error":"#N/A"},{"$error":"#N/A"},{"$error":"#N/A"},{"$error":"#VALUE!"},{"$error":"#VALUE!"},{"$error":"#N/A"},null,{"$error":"#VALUE!"},{"$error":"#N/A"},{"$error":"#N/A"},{"$error":"#N/A"},{"$error":"#N/A"},{"$error":"#VALUE!"},{"$error":"#VALUE!"},{"$error":"#N/A"},null,{"$error":"#VALUE!"},{"$error":"#N/A"},{"$error":"#N/A"},{"$error":"#N/A"},{"$error":"#N/A"},{"$error":"#VALUE!"},{"$error":"#VALUE!"},{"$error":"#N/A"}]
[2083,{"$error":"#VALUE!"},{"$error":"#N/A"},{"$error":"#VALUE!"},{"$error":"#N/A"},{"$error":"#N/A"},{"$error":"#VALUE!"},{"$error":"#VALUE!"},{"$error":"#N/A"},null,{"$error":"#VALUE!"},{"$error":"#N/A"},{"$error":"#N/A"},{"$error":"#N/A"},{"$error":"#N/A"},{"$error":"#VALUE!"},{"$error":"#VALUE!"},{"$error":"#N/A"},null,{"$error":"#VALUE!"},{"$error":"#N/A"},{"$error":"#N/A"},{"$error":"#N/A"},{"$error":"#N/A"},{"$error":"#VALUE!"},{"$error":"#VALUE!"},{"$error":"#N/A"},null,{"$error":"#VALUE!"},{"$error":"#N/A"},{"$error":"#N/A"},{"$error":"#N/A"},{"$error":"#N/A"},{"$error":"#VALUE!"},{"$error":"#VALUE!"},{"$error":"#N/A"},null,{"$error":"#VALUE!"},{"$error":"#N/A"},{"$error":"#N/A"},{"$error":"#N/A"},{"$error":"#N/A"},{"$error":"#VALUE!"},{"$error":"#VALUE!"},{"$error":"#N/A"},null,{"$error":"#VALUE!"},{"$error":"#N/A"},{"$error":"#N/A"},{"$error":"#N/A"},{"$error":"#N/A"},{"$error":"#VALUE!"},{"$error":"#VALUE!"},{"$error":"#N/A"},null,{"$error":"#VALUE!"},{"$error":"#N/A"},{"$error":"#N/A"},{"$error":"#N/A"},{"$error":"#N/A"},{"$error":"#VALUE!"},{"$error":"#VALUE!"},{"$error":"#N/A"},null,{"$error":"#VALUE!"},{"$error":"#N/A"},{"$error":"#N/A"},{"$error":"#N/A"},{"$error":"#N/A"},{"$error":"#VALUE!"},{"$error":"#VALUE!"},{"$error":"#N/A"},null,{"$error":"#VALUE!"},{"$error":"#N/A"},{"$error":"#N/A"},{"$error":"#N/A"},{"$error":"#N/A"},{"$error":"#VALUE!"},{"$error":"#VALUE!"},{"$error":"#N/A"},null,{"$error":"#VALUE!"},{"$error":"#N/A"},{"$error":"#N/A"},{"$error":"#N/A"},{"$error":"#N/A"},{"$error":"#VALUE!"},{"$error":"#VALUE!"},{"$error":"#N/A"},null,{"$error":"#VALUE!"},{"$error":"#N/A"},{"$error":"#N/A"},{"$error":"#N/A"},{"$error":"#N/A"},{"$error":"#VALUE!"},{"$error":"#VALUE!"},{"$error":"#N/A"},null,{"$error":"#VALUE!"},{"$error":"#N/A"},{"$error":"#N/A"},{"$error":"#N/A"},{"$error":"#N/A"},{"$error":"#VALUE!"},{"$error":"#VALUE!"},{"$error":"#N/A"}]
[2084,{"$error":"#VALUE!"},{"$error":"#N/A"},{"$error":"#VALUE!"},{"$error":"#N/A"},{"$f":"IF(E76<=0,0,IF(B76<INDEX($C$87:$G$88,MATCH($C$3,$C$87:$C$88,0),5),$C$6,0))","v":{"$error":"#N/A"}},{"$f":"IF($C$7=\"\",IF(B76<INDEX($C$87:$G$88,MATCH($C$3,$C$87:$C$88,0),5),$L$98,$L$99),IF(B76<INDEX($C$87:$G$88,MATCH($C$3,$C$87:$C$88,0),5),$C$7,$C$8))","v":{"$error":"#VALUE!"}},{"$error":"#VALUE!"},{"$error":"#N/A"},null,{"$error":"#VALUE!"},{"$error":"#N/A"},{"$error":"#N/A"},{"$error":"#N/A"},{"$f":"IF(N76<=0,0,IF(K76<INDEX($C$87:$G$88,MATCH($L$3,$C$87:$C$88,0),5),$L$6,0))","v":{"$error":"#N/A"}},{"$f":"IF($L$7=\"\",IF(K76<INDEX($C$87:$G$88,MATCH($L$3,$C$87:$C$88,0),5),$L$98,$L$99),IF(K76<INDEX($C$87:$G$88,MATCH($L$3,$C$87:$C$88,0),5),$L$7,$L$8))","v":{"$error":"#VALUE!"}},{"$error":"#VALUE!"},{"$error":"#N/A"},null,{"$error":"#VALUE!"},{"$error":"#N/A"},{"$error":"#N/A"},{"$error":"#N/A"},{"$f":"IF(W76<=0,0,IF(T76<INDEX($C$87:$G$88,MATCH($U$3,$C$87:$C$88,0),5),$U$6,0))","v":{"$error":"#N/A"}},{"$f":"IF($U$7=\"\",IF(T76<INDEX($C$87:$G$88,MATCH($U$3,$C$87:$C$88,0),5),$L$98,$L$99),IF(T76<INDEX($C$87:$G$88,MATCH($U$3,$C$87:$C$88,0),5),$U$7,$U$8))","v":{"$error":"#VALUE!"}},{"$error":"#VALUE!"},{"$error":"#N/A"},null,{"$error":"#VALUE!"},{"$error":"#N/A"},{"$error":"#N/A"},{"$error":"#N/A"},{"$f":"IF(AF76<=0,0,IF(AC76<INDEX($C$87:$G$88,MATCH($AD$3,$C$87:$C$88,0),5),$AD$6,0))","v":{"$error":"#N/A"}},{"$f":"IF($AD$7=\"\",IF(AC76<INDEX($C$87:$G$88,MATCH($AD$3,$C$87:$C$88,0),5),$L$98,$L$99),IF(AC76<INDEX($C$87:$G$88,MATCH($AD$3,$C$87:$C$88,0),5),$AD$7,$AD$8))","v":{"$error":"#VALUE!"}},{"$error":"#VALUE!"},{"$error":"#N/A"},null,{"$error":"#VALUE!"},{"$error":"#N/A"},{"$error":"#N/A"},{"$error":"#N/A"},{"$f":"IF(AO76<=0,0,IF(AL76<INDEX($C$87:$G$88,MATCH($AM$3,$C$87:$C$88,0),5),$AM$6,0))","v":{"$error":"#N/A"}},{"$f":"IF($AM$7=\"\",IF(AL76<INDEX($C$87:$G$88,MATCH($AM$3,$C$87:$C$88,0),5),$L$98,$L$99),IF(AL76<INDEX($C$87:$G$88,MATCH($AM$3,$C$87:$C$88,0),5),$AM$7,$AM$8))","v":{"$error":"#VALUE!"}},{"$error":"#VALUE!"},{"$error":"#N/A"},null,{"$error":"#VALUE!"},{"$error":"#N/A"},{"$error":"#N/A"},{"$error":"#N/A"},{"$f":"IF(AX76<=0,0,IF(AU76<INDEX($C$87:$G$88,MATCH($AV$3,$C$87:$C$88,0),5),$AV$6,0))","v":{"$error":"#N/A"}},{"$f":"IF($AV$7=\"\",IF(AU76<INDEX($C$87:$G$88,MATCH($AV$3,$C$87:$C$88,0),5),$L$98,$L$99),IF(AU76<INDEX($C$87:$G$88,MATCH($AV$3,$C$87:$C$88,0),5),$AV$7,$AV$8))","v":{"$error":"#VALUE!"}},{"$error":"#VALUE!"},{"$error":"#N/A"},null,{"$error":"#VALUE!"},{"$error":"#N/A"},{"$error":"#N/A"},{"$error":"#N/A"},{"$f":"IF(BG76<=0,0,IF(BD76<INDEX($C$87:$G$88,MATCH($BE$3,$C$87:$C$88,0),5),$BE$6,0))","v":{"$error":"#N/A"}},{"$f":"IF($BE$7=\"\",IF(BD76<INDEX($C$87:$G$88,MATCH($BE$3,$C$87:$C$88,0),5),$L$98,$L$99),IF(BD76<INDEX($C$87:$G$88,MATCH($BE$3,$C$87:$C$88,0),5),$BE$7,$BE$8))","v":{"$error":"#VALUE!"}},{"$error":"#VALUE!"},{"$error":"#N/A"},null,{"$error":"#VALUE!"},{"$error":"#N/A"},{"$error":"#N/A"},{"$error":"#N/A"},{"$f":"IF(BP76<=0,0,IF(BM76<INDEX($C$87:$G$88,MATCH($BN$3,$C$87:$C$88,0),5),$BN$6,0))","v":{"$error":"#N/A"}},{"$f":"IF($BN$7=\"\",IF(BM76<INDEX($C$87:$G$88,MATCH($BN$3,$C$87:$C$88,0),5),$L$98,$L$99),IF(BM76<INDEX($C$87:$G$88,MATCH($BN$3,$C$87:$C$88,0),5),$BN$7,$BN$8))","v":{"$error":"#VALUE!"}},{"$error":"#VALUE!"},{"$error":"#N/A"},null,{"$error":"#VALUE!"},{"$error":"#N/A"},{"$error":"#N/A"},{"$error":"#N/A"},{"$f":"IF(BY76<=0,0,IF(BV76<INDEX($C$87:$G$88,MATCH($BW$3,$C$87:$C$88,0),5),$BW$6,0))","v":{"$error":"#N/A"}},{"$f":"IF($BW$7=\"\",IF(BV76<INDEX($C$87:$G$88,MATCH($BW$3,$C$87:$C$88,0),5),$L$98,$L$99),IF(BV76<INDEX($C$87:$G$88,MATCH($BW$3,$C$87:$C$88,0),5),$BW$7,$BW$8))","v":{"$error":"#VALUE!"}},{"$error":"#VALUE!"},{"$error":"#N/A"},null,{"$error":"#VALUE!"},{"$error":"#N/A"},{"$error":"#N/A"},{"$error":"#N/A"},{"$f":"IF(CH76<=0,0,IF(CE76<INDEX($C$87:$G$88,MATCH($CF$3,$C$87:$C$88,0),5),$CF$6,0))","v":{"$error":"#N/A"}},{"$f":"IF($CF$7=\"\",IF(CE76<INDEX($C$87:$G$88,MATCH($CF$3,$C$87:$C$88,0),5),$L$98,$L$99),IF(CE76<INDEX($C$87:$G$88,MATCH($CF$3,$C$87:$C$88,0),5),$CF$7,$CF$8))","v":{"$error":"#VALUE!"}},{"$error":"#VALUE!"},{"$error":"#N/A"},null,{"$error":"#VALUE!"},{"$error":"#N/A"},{"$error":"#N/A"},{"$error":"#N/A"},{"$f":"IF(CQ76<=0,0,IF(CN76<INDEX($C$87:$G$88,MATCH($CO$3,$C$87:$C$88,0),5),$CO$6,0))","v":{"$error":"#N/A"}},{"$error":"#VALUE!"},{"$error":"#VALUE!"},{"$error":"#N/A"},null,{"$error":"#VALUE!"},{"$error":"#N/A"},{"$error":"#N/A"},{"$error":"#N/A"},{"$f":"IF(CZ76<=0,0,IF(CW76<INDEX($C$87:$G$88,MATCH($CX$3,$C$87:$C$88,0),5),$CX$6,0))","v":{"$error":"#N/A"}},{"$f":"IF($CX$7=\"\",IF(CW76<INDEX($C$87:$G$88,MATCH($CX$3,$C$87:$C$88,0),5),$L$98,$L$99),IF(CW76<INDEX($C$87:$G$88,MATCH($CX$3,$C$87:$C$88,0),5),$C$7,$C$8))","v":{"$error":"#VALUE!"}},{"$error":"#VALUE!"},{"$error":"#N/A"}]
[2085,{"$error":"#VALUE!"},{"$f":"I76","v":{"$error":"#N/A"}},{"$f":"IF(INDEX($A$135:$W$206,MATCH(A77,$A$135:$A$206,0),MATCH($Q$135,$135:$135,0))>0,0,INDEX($A$135:$W$206,MATCH(A77,$A$135:$A$206,0),MATCH($Q$135,$135:$135,0)))","v":{"$error":"#VALUE!"}},{"$error":"#N/A"},{"$error":"#N/A"},{"$error":"#VALUE!"},{"$error":"#VALUE!"},{"$error":"#N/A"},null,{"$error":"#VALUE!"},{"$f":"R76","v":{"$error":"#N/A"}},{"$error":"#N/A"},{"$error":"#N/A"},{"$error":"#N/A"},{"$error":"#VALUE!"},{"$error":"#VALUE!"},{"$error":"#N/A"},null,{"$error":"#VALUE!"},{"$f":"AA76","v":{"$error":"#N/A"}},{"$f":"IF(N77<0,N77,0)","v":{"$error":"#N/A"}},{"$error":"#N/A"},{"$error":"#N/A"},{"$error":"#VALUE!"},{"$error":"#VALUE!"},{"$error":"#N/A"},null,{"$error":"#VALUE!"},{"$f":"AJ76","v":{"$error":"#N/A"}},{"$f":"IF(W77<0,W77,0)","v":{"$error":"#N/A"}},{"$error":"#N/A"},{"$error":"#N/A"},{"$error":"#VALUE!"},{"$error":"#VALUE!"},{"$error":"#N/A"},null,{"$error":"#VALUE!"},{"$f":"AS76","v":{"$error":"#N/A"}},{"$f":"IF(AF77<0,AF77,0)","v":{"$error":"#N/A"}},{"$error":"#N/A"},{"$error":"#N/A"},{"$error":"#VALUE!"},{"$error":"#VALUE!"},{"$error":"#N/A"},null,{"$error":"#VALUE!"},{"$f":"BB76","v":{"$error":"#N/A"}},{"$f":"IF(AO77<0,AO77,0)","v":{"$error":"#N/A"}},{"$error":"#N/A"},{"$error":"#N/A"},{"$error":"#VALUE!"},{"$error":"#VALUE!"},{"$error":"#N/A"},null,{"$error":"#VALUE!"},{"$f":"BK76","v":{"$error":"#N/A"}},{"$f":"IF(AX77<0,AX77,0)","v":{"$error":"#N/A"}},{"$error":"#N/A"},{"$error":"#N/A"},{"$error":"#VALUE!"},{"$error":"#VALUE!"},{"$error":"#N/A"},null,{"$error":"#VALUE!"},{"$f":"BT76","v":{"$error":"#N/A"}},{"$f":"IF(BG77<0,BG77,0)","v":{"$error":"#N/A"}},{"$error":"#N/A"},{"$error":"#N/A"},{"$error":"#VALUE!"},{"$error":"#VALUE!"},{"$error":"#N/A"},null,{"$error":"#VALUE!"},{"$f":"CC76","v":{"$error":"#N/A"}},{"$f":"IF(BP77<0,BP77,0)","v":{"$error":"#N/A"}},{"$error":"#N/A"},{"$error":"#N/A"},{"$error":"#VALUE!"},{"$error":"#VALUE!"},{"$error":"#N/A"},null,{"$error":"#VALUE!"},{"$f":"CL76","v":{"$error":"#N/A"}},{"$f":"IF(BY77<0,BY77,0)","v":{"$error":"#N/A"}},{"$error":"#N/A"},{"$error":"#N/A"},{"$error":"#VALUE!"},{"$error":"#VALUE!"},{"$error":"#N/A"},null,{"$error":"#VALUE!"},{"$f":"CU76","v":{"$error":"#N/A"}},{"$f":"IF(CH77<0,CH77,0)","v":{"$error":"#N/A"}},{"$error":"#N/A"},{"$error":"#N/A"},{"$f":"IF($CO$7=\"\",IF(CN77<INDEX($C$87:$G$88,MATCH($C$3,$C$87:$C$88,0),5),$L$98,$L$99),IF(CN77<INDEX($C$87:$G$88,MATCH($C$3,$C$87:$C$88,0),5),$C$7,$C$8))","v":{"$error":"#VALUE!"}},{"$error":"#VALUE!"},{"$error":"#N/A"},null,{"$error":"#VALUE!"},{"$f":"DD76","v":{"$error":"#N/A"}},{"$f":"IF(CQ77<0,CQ77,0)","v":{"$error":"#N/A"}},{"$error":"#N/A"},{"$error":"#N/A"},{"$error":"#VALUE!"},{"$error":"#VALUE!"},{"$error":"#N/A"}]
[{"$f":"A77+1","v":2086},{"$error":"#VALUE!"},{"$error":"#N/A"},{"$error":"#VALUE!"},{"$error":"#N/A"},{"$error":"#N/A"},{"$error":"#VALUE!"},{"$error":"#VALUE!"},{"$error":"#N/A"},null,{"$f":"K77+1","v":{"$error":"#VALUE!"}},{"$error":"#N/A"},{"$error":"#N/A"},{"$error":"#N/A"},{"$error":"#N/A"},{"$error":"#VALUE!"},{"$error":"#VALUE!"},{"$error":"#N/A"},null,{"$f":"T77+1","v":{"$error":"#VALUE!"}},{"$error":"#N/A"},{"$error":"#N/A"},{"$error":"#N/A"},{"$error":"#N/A"},{"$error":"#VALUE!"},{"$error":"#VALUE!"},{"$error":"#N/A"},null,{"$f":"AC77+1","v":{"$error":"#VALUE!"}},{"$error":"#N/A"},{"$error":"#N/A"},{"$error":"#N/A"},{"$error":"#N/A"},{"$error":"#VALUE!"},{"$error":"#VALUE!"},{"$error":"#N/A"},null,{"$f":"AL77+1","v":{"$error":"#VALUE!"}},{"$error":"#N/A"},{"$error":"#N/A"},{"$error":"#N/A"},{"$error":"#N/A"},{"$error":"#VALUE!"},{"$error":"#VALUE!"},{"$error":"#N/A"},null,{"$f":"AU77+1","v":{"$error":"#VALUE!"}},{"$error":"#N/A"},{"$error":"#N/A"},{"$error":"#N/A"},{"$error":"#N/A"},{"$error":"#VALUE!"},{"$error":"#VALUE!"},{"$error":"#N/A"},null,{"$f":"BD77+1","v":{"$error":"#VALUE!"}},{"$error":"#N/A"},{"$error":"#N/A"},{"$error":"#N/A"},{"$error":"#N/A"},{"$error":"#VALUE!"},{"$error":"#VALUE!"},{"$error":"#N/A"},null,{"$f":"BM77+1","v":{"$error":"#VALUE!"}},{"$error":"#N/A"},{"$error":"#N/A"},{"$error":"#N/A"},{"$error":"#N/A"},{"$error":"#VALUE!"},{"$error":"#VALUE!"},{"$error":"#N/A"},null,{"$f":"BV77+1","v":{"$error":"#VALUE!"}},{"$error":"#N/A"},{"$error":"#N/A"},{"$error":"#N/A"},{"$error":"#N/A"},{"$error":"#VALUE!"},{"$error":"#VALUE!"},{"$error":"#N/A"},null,{"$f":"CE77+1","v":{"$error":"#VALUE!"}},{"$error":"#N/A"},{"$error":"#N/A"},{"$error":"#N/A"},{"$error":"#N/A"},{"$error":"#VALUE!"},{"$error":"#VALUE!"},{"$error":"#N/A"},null,{"$f":"CN77+1","v":{"$error":"#VALUE!"}},{"$error":"#N/A"},{"$error":"#N/A"},{"$error":"#N/A"},{"$error":"#N/A"},{"$error":"#VALUE!"},{"$error":"#VALUE!"},{"$error":"#N/A"},null,{"$f":"CW77+1","v":{"$error":"#VALUE!"}},{"$error":"#N/A"},{"$error":"#N/A"},{"$error":"#N/A"},{"$error":"#N/A"},{"$error":"#VALUE!"},{"$error":"#VALUE!"},{"$error":"#N/A"}]
[2087,{"$error":"#VALUE!"},{"$error":"#N/A"},{"$error":"#VALUE!"},{"$f":"SUM(C79:D79)","v":{"$error":"#N/A"}},{"$error":"#N/A"},{"$error":"#VALUE!"},{"$error":"#VALUE!"},{"$error":"#N/A"},null,{"$error":"#VALUE!"},{"$error":"#N/A"},{"$error":"#N/A"},{"$error":"#N/A"},{"$error":"#N/A"},{"$error":"#VALUE!"},{"$error":"#VALUE!"},{"$error":"#N/A"},null,{"$error":"#VALUE!"},{"$error":"#N/A"},{"$error":"#N/A"},{"$error":"#N/A"},{"$error":"#N/A"},{"$error":"#VALUE!"},{"$error":"#VALUE!"},{"$error":"#N/A"},null,{"$error":"#VALUE!"},{"$error":"#N/A"},{"$error":"#N/A"},{"$error":"#N/A"},{"$error":"#N/A"},{"$error":"#VALUE!"},{"$error":"#VALUE!"},{"$error":"#N/A"},null,{"$error":"#VALUE!"},{"$error":"#N/A"},{"$error":"#N/A"},{"$error":"#N/A"},{"$error":"#N/A"},{"$error":"#VALUE!"},{"$error":"#VALUE!"},{"$error":"#N/A"},null,{"$error":"#VALUE!"},{"$error":"#N/A"},{"$error":"#N/A"},{"$error":"#N/A"},{"$error":"#N/A"},{"$error":"#VALUE!"},{"$error":"#VALUE!"},{"$error":"#N/A"},null,{"$error":"#VALUE!"},{"$error":"#N/A"},{"$error":"#N/A"},{"$error":"#N/A"},{"$error":"#N/A"},{"$error":"#VALUE!"},{"$error":"#VALUE!"},{"$error":"#N/A"},null,{"$error":"#VALUE!"},{"$error":"#N/A"},{"$error":"#N/A"},{"$error":"#N/A"},{"$error":"#N/A"},{"$error":"#VALUE!"},{"$error":"#VALUE!"},{"$error":"#N/A"},null,{"$error":"#VALUE!"},{"$error":"#N/A"},{"$error":"#N/A"},{"$error":"#N/A"},{"$error":"#N/A"},{"$error":"#VALUE!"},{"$error":"#VALUE!"},{"$error":"#N/A"},null,{"$error":"#VALUE!"},{"$error":"#N/A"},{"$error":"#N/A"},{"$error":"#N/A"},{"$error":"#N/A"},{"$error":"#VALUE!"},{"$error":"#VALUE!"},{"$error":"#N/A"},null,{"$error":"#VALUE!"},{"$error":"#N/A"},{"$error":"#N/A"},{"$error":"#N/A"},{"$error":"#N/A"},{"$error":"#VALUE!"},{"$error":"#VALUE!"},{"$error":"#N/A"},null,{"$error":"#VALUE!"},{"$error":"#N/A"},{"$error":"#N/A"},{"$error":"#N/A"},{"$error":"#N/A"},{"$error":"#VALUE!"},{"$error":"#VALUE!"},{"$error":"#N/A"}]
[2088,{"$error":"#VALUE!"},{"$error":"#N/A"},{"$error":"#VALUE!"},{"$error":"#N/A"},{"$error":"#N/A"},{"$error":"#VALUE!"},{"$f":"IF(G80*SUM(E80:F80)<0,0,G80*SUM(E80:F80))","v":{"$error":"#VALUE!"}},{"$f":"IF(SUM(E80:F80,H80)<0,0,SUM(E80:F80,H80))","v":{"$error":"#N/A"}},null,{"$error":"#VALUE!"},{"$error":"#N/A"},{"$f":"IF(E80<0,E80,0)","v":{"$error":"#N/A"}},{"$f":"SUM(L80:M80)","v":{"$error":"#N/A"}},{"$error":"#N/A"},{"$error":"#VALUE!"},{"$error":"#VALUE!"},{"$f":"IF(SUM(N80:O80,Q80)<0,0,(SUM(N80:O80,Q80)))","v":{"$error":"#N/A"}},null,{"$error":"#VALUE!"},{"$error":"#N/A"},{"$error":"#N/A"},{"$f":"SUM(U80:V80)","v":{"$error":"#N/A"}},{"$error":"#N/A"},{"$error":"#VALUE!"},{"$error":"#VALUE!"},{"$f":"IF(SUM(W80:X80,Z80)<0,0,(SUM(W80:X80,Z80)))","v":{"$error":"#N/A"}},null,{"$error":"#VALUE!"},{"$error":"#N/A"},{"$error":"#N/A"},{"$f":"SUM(AD80:AE80)","v":{"$error":"#N/A"}},{"$error":"#N/A"},{"$error":"#VALUE!"},{"$error":"#VALUE!"},{"$f":"IF(SUM(AF80:AG80,AI80)<0,0,(SUM(AF80:AG80,AI80)))","v":{"$error":"#N/A"}},null,{"$error":"#VALUE!"},{"$error":"#N/A"},{"$error":"#N/A"},{"$f":"SUM(AM80:AN80)","v":{"$error":"#N/A"}},{"$error":"#N/A"},{"$error":"#VALUE!"},{"$error":"#VALUE!"},{"$f":"IF(SUM(AO80:AP80,AR80)<0,0,(SUM(AO80:AP80,AR80)))","v":{"$error":"#N/A"}},null,{"$error":"#VALUE!"},{"$error":"#N/A"},{"$error":"#N/A"},{"$f":"SUM(AV80:AW80)","v":{"$error":"#N/A"}},{"$error":"#N/A"},{"$error":"#VALUE!"},{"$error":"#VALUE!"},{"$f":"IF(SUM(AX80:AY80,BA80)<0,0,(SUM(AX80:AY80,BA80)))","v":{"$error":"#N/A"}},null,{"$error":"#VALUE!"},{"$error":"#N/A"},{"$error":"#N/A"},{"$f":"SUM(BE80:BF80)","v":{"$error":"#N/A"}},{"$error":"#N/A"},{"$error":"#VALUE!"},{"$error":"#VALUE!"},{"$f":"IF(SUM(BG80:BH80,BJ80)<0,0,(SUM(BG80:BH80,BJ80)))","v":{"$error":"#N/A"}},null,{"$error":"#VALUE!"},{"$error":"#N/A"},{"$error":"#N/A"},{"$f":"SUM(BN80:BO80)","v":{"$error":"#N/A"}},{"$error":"#N/A"},{"$error":"#VALUE!"},{"$error":"#VALUE!"},{"$f":"IF(SUM(BP80:BQ80,BS80)<0,0,(SUM(BP80:BQ80,BS80)))","v":{"$error":"#N/A"}},null,{"$error":"#VALUE!"},{"$error":"#N/A"},{"$error":"#N/A"},{"$f":"SUM(BW80:BX80)","v":{"$error":"#N/A"}},{"$error":"#N/A"},{"$error":"#VALUE!"},{"$error":"#VALUE!"},{"$f":"IF(SUM(BY80:BZ80,CB80)<0,0,(SUM(BY80:BZ80,CB80)))","v":{"$error":"#N/A"}},null,{"$error":"#VALUE!"},{"$error":"#N/A"},{"$error":"#N/A"},{"$f":"SUM(CF80:CG80)","v":{"$error":"#N/A"}},{"$error":"#N/A"},{"$error":"#VALUE!"},{"$error":"#VALUE!"},{"$f":"IF(SUM(CH80:CI80,CK80)<0,0,(SUM(CH80:CI80,CK80)))","v":{"$error":"#N/A"}},null,{"$error":"#VALUE!"},{"$error":"#N/A"},{"$error":"#N/A"},{"$f":"SUM(CO80:CP80)","v":{"$error":"#N/A"}},{"$error":"#N/A"},{"$error":"#VALUE!"},{"$error":"#VALUE!"},{"$f":"IF(SUM(CQ80:CR80,CT80)<0,0,(SUM(CQ80:CR80,CT80)))","v":{"$error":"#N/A"}},null,{"$error":"#VALUE!"},{"$error":"#N/A"},{"$error":"#N/A"},{"$f":"SUM(CX80:CY80)","v":{"$error":"#N/A"}},{"$error":"#N/A"},{"$error":"#VALUE!"},{"$error":"#VALUE!"},{"$f":"IF(SUM(CZ80:DA80,DC80)<0,0,(SUM(CZ80:DA80,DC80)))","v":{"$error":"#N/A"}}]
[2089,{"$error":"#VALUE!"},{"$error":"#N/A"},{"$error":"#VALUE!"},{"$error":"#N/A"},{"$error":"#N/A"},{"$error":"#VALUE!"},{"$error":"#VALUE!"},{"$error":"#N/A"},null,{"$error":"#VALUE!"},{"$error":"#N/A"},{"$error":"#N/A"},{"$error":"#N/A"},{"$error":"#N/A"},{"$error":"#VALUE!"},{"$f":"IF(P81*SUM(N81:O81)<0,0,P81*SUM(N81:O81))","v":{"$error":"#VALUE!"}},{"$error":"#N/A"},null,{"$error":"#VALUE!"},{"$error":"#N/A"},{"$error":"#N/A"},{"$error":"#N/A"},{"$error":"#N/A"},{"$error":"#VALUE!"},{"$f":"IF(Y81*SUM(W81:X81)<0,0,Y81*SUM(W81:X81))","v":{"$error":"#VALUE!"}},{"$error":"#N/A"},null,{"$error":"#VALUE!"},{"$error":"#N/A"},{"$error":"#N/A"},{"$error":"#N/A"},{"$error":"#N/A"},{"$error":"#VALUE!"},{"$f":"IF(AH81*SUM(AF81:AG81)<0,0,AH81*SUM(AF81:AG81))","v":{"$error":"#VALUE!"}},{"$error":"#N/A"},null,{"$error":"#VALUE!"},{"$error":"#N/A"},{"$error":"#N/A"},{"$error":"#N/A"},{"$error":"#N/A"},{"$error":"#VALUE!"},{"$f":"IF(AQ81*SUM(AO81:AP81)<0,0,AQ81*SUM(AO81:AP81))","v":{"$error":"#VALUE!"}},{"$error":"#N/A"},null,{"$error":"#VALUE!"},{"$error":"#N/A"},{"$error":"#N/A"},{"$error":"#N/A"},{"$error":"#N/A"},{"$error":"#VALUE!"},{"$f":"IF(AZ81*SUM(AX81:AY81)<0,0,AZ81*SUM(AX81:AY81))","v":{"$error":"#VALUE!"}},{"$error":"#N/A"},null,{"$error":"#VALUE!"},{"$error":"#N/A"},{"$error":"#N/A"},{"$error":"#N/A"},{"$error":"#N/A"},{"$error":"#VALUE!"},{"$f":"IF(BI81*SUM(BG81:BH81)<0,0,BI81*SUM(BG81:BH81))","v":{"$error":"#VALUE!"}},{"$error":"#N/A"},null,{"$error":"#VALUE!"},{"$error":"#N/A"},{"$error":"#N/A"},{"$error":"#N/A"},{"$error":"#N/A"},{"$error":"#VALUE!"},{"$f":"IF(BR81*SUM(BP81:BQ81)<0,0,BR81*SUM(BP81:BQ81))","v":{"$error":"#VALUE!"}},{"$error":"#N/A"},null,{"$error":"#VALUE!"},{"$error":"#N/A"},{"$error":"#N/A"},{"$error":"#N/A"},{"$error":"#N/A"},{"$error":"#VALUE!"},{"$f":"IF(CA81*SUM(BY81:BZ81)<0,0,CA81*SUM(BY81:BZ81))","v":{"$error":"#VALUE!"}},{"$error":"#N/A"},null,{"$error":"#VALUE!"},{"$error":"#N/A"},{"$error":"#N/A"},{"$error":"#N/A"},{"$error":"#N/A"},{"$error":"#VALUE!"},{"$f":"IF(CJ81*SUM(CH81:CI81)<0,0,CJ81*SUM(CH81:CI81))","v":{"$error":"#VALUE!"}},{"$error":"#N/A"},null,{"$error":"#VALUE!"},{"$error":"#N/A"},{"$error":"#N/A"},{"$error":"#N/A"},{"$error":"#N/A"},{"$error":"#VALUE!"},{"$f":"IF(CS81*SUM(CQ81:CR81)<0,0,CS81*SUM(CQ81:CR81))","v":{"$error":"#VALUE!"}},{"$error":"#N/A"},null,{"$error":"#VALUE!"},{"$error":"#N/A"},{"$error":"#N/A"},{"$error":"#N/A"},{"$error":"#N/A"},{"$error":"#VALUE!"},{"$f":"IF(DB81*SUM(CZ81:DA81)<0,0,DB81*SUM(CZ81:DA81))","v":{"$error":"#VALUE!"}},{"$error":"#N/A"}]
[2090,{"$error":"#VALUE!"},{"$error":"#N/A"},{"$error":"#VALUE!"},{"$error":"#N/A"},{"$error":"#N/A"},{"$error":"#VALUE!"},{"$error":"#VALUE!"},{"$error":"#N/A"},null,{"$error":"#VALUE!"},{"$error":"#N/A"},{"$error":"#N/A"},{"$error":"#N/A"},{"$error":"#N/A"},{"$error":"#VALUE!"},{"$error":"#VALUE!"},{"$error":"#N/A"},null,{"$error":"#VALUE!"},{"$error":"#N/A"},{"$error":"#N/A"},{"$error":"#N/A"},{"$error":"#N/A"},{"$error":"#VALUE!"},{"$error":"#VALUE!"},{"$error":"#N/A"},null,{"$error":"#VALUE!"},{"$error":"#N/A"},{"$error":"#N/A"},{"$error":"#N/A"},{"$error":"#N/A"},{"$error":"#VALUE!"},{"$error":"#VALUE!"},{"$error":"#N/A"},null,{"$error":"#VALUE!"},{"$error":"#N/A"},{"$error":"#N/A"},{"$error":"#N/A"},{"$error":"#N/A"},{"$error":"#VALUE!"},{"$error":"#VALUE!"},{"$error":"#N/A"},null,{"$error":"#VALUE!"},{"$error":"#N/A"},{"$error":"#N/A"},{"$error":"#N/A"},{"$error":"#N/A"},{"$error":"#VALUE!"},{"$error":"#VALUE!"},{"$error":"#N/A"},null,{"$error":"#VALUE!"},{"$error":"#N/A"},{"$error":"#N/A"},{"$error":"#N/A"},{"$error":"#N/A"},{"$error":"#VALUE!"},{"$error":"#VALUE!"},{"$error":"#N/A"},null,{"$error":"#VALUE!"},{"$error":"#N/A"},{"$error":"#N/A"},{"$error":"#N/A"},{"$error":"#N/A"},{"$error":"#VALUE!"},{"$error":"#VALUE!"},{"$error":"#N/A"},null,{"$error":"#VALUE!"},{"$error":"#N/A"},{"$error":"#N/A"},{"$error":"#N/A"},{"$error":"#N/A"},{"$error":"#VALUE!"},{"$error":"#VALUE!"},{"$error":"#N/A"},null,{"$error":"#VALUE!"},{"$error":"#N/A"},{"$error":"#N/A"},{"$error":"#N/A"},{"$error":"#N/A"},{"$error":"#VALUE!"},{"$error":"#VALUE!"},{"$error":"#N/A"},null,{"$error":"#VALUE!"},{"$error":"#N/A"},{"$error":"#N/A"},{"$error":"#N/A"},{"$error":"#N/A"},{"$error":"#VALUE!"},{"$error":"#VALUE!"},{"$error":"#N/A"},null,{"$error":"#VALUE!"},{"$error":"#N/A"},{"$error":"#N/A"},{"$error":"#N/A"},{"$error":"#N/A"},{"$error":"#VALUE!"},{"$error":"#VALUE!"},{"$error":"#N/A"}]
[]
["TOTAL",null,null,{"$f":"SUM(D12:D82)","v":{"$error":"#VALUE!"}},null,{"$f":"SUM(H12:H82)","v":{"$error":"#N/A"}},null,null,null,null,null,null,{"$f":"SUM(M12:M82)","v":{"$error":"#VALUE!"}},null,{"$f":"SUM(Q12:Q82)","v":{"$error":"#N/A"}},null,null,null,null,null,null,{"$f":"SUM(V12:V82)","v":{"$error":"#VALUE!"}},null,{"$f":"SUM(Z12:Z82)","v":{"$error":"#N/A"}}]
[]
[null,null,{"$f":"'Retirement Scenario'!C5","v":"Name"},null,{"$f":"'Retirement Scenario'!E5","v":"DOB"},{"$f":"'Retirement Scenario'!F5","v":"Current Age"},{"$f":"'Retirement Scenario'!G5","v":"Ret. Age"},{"$f":"'Retirement Scenario'!H5","v":"S.S. Start Age"},{"$f":"'Retirement Scenario'!I5","v":"Pension?"},{"$f":"'Retirement Scenario'!J5","v":"Pension Start Age"}]
[null,null,{"$f":"IF('Retirement Scenario'!C6=0,\"\",'Retirement Scenario'!C6)","v":""},{"$f":"IF('Retirement Scenario'!D6=0,\"\",'Retirement Scenario'!D6)","v":""},{"$f":"IF('Retirement Scenario'!E6=0,\"\",'Retirement Scenario'!E6)","v":""},{"$f":"IFERROR(YEAR($L$91)-YEAR(E87),\"\")","v":""},{"$f":"IF('Retirement Scenario'!G6=0,\"\",'Retirement Scenario'!G6)","v":""},{"$f":"IF('Retirement Scenario'!H6=0,\"\",'Retirement Scenario'!H6)","v":""},{"$f":"IF('Retirement Scenario'!I6=0,\"\",'Retirement Scenario'!I6)","v":""},{"$f":"IF('Retirement Scenario'!J6=0,\"\",'Retirement Scenario'!J6)","v":""}]
[null,null,{"$f":"IF('Retirement Scenario'!C7=0,\"\",'Retirement Scenario'!C7)","v":""},{"$f":"IF('Retirement Scenario'!D7=0,\"\",'Retirement Scenario'!D7)","v":""},{"$f":"IF('Retirement Scenario'!E7=0,\"\",'Retirement Scenario'!E7)","v":""},{"$f":"IFERROR(YEAR($L$91)-YEAR(E88),\"\")","v":""},{"$f":"IF('Retirement Scenario'!G7=0,\"\",'Retirement Scenario'!G7)","v":""},{"$f":"IF('Retirement Scenario'!H7=0,\"\",'Retirement Scenario'!H7)","v":""},{"$f":"IF('Retirement Scenario'!I7=0,\"\",'Retirement Scenario'!I7)","v":""},{"$f":"IF('Retirement Scenario'!J7=0,\"\",'Retirement Scenario'!J7)","v":""}]
[]
[null,null,{"$f":"'Retirement Scenario'!C13","v":"'s Invested Assets Available Upon Retirement"}]
[null,null,{"$f":"'Retirement Scenario'!C14","v":"Account Type"},{"$f":"'Retirement Scenario'!D14","v":"Detail"},{"$f":"'Retirement Scenario'!E14","v":"Balance"},{"$f":"'Retirement Scenario'!F14","v":"Contributions"},{"$f":"'Retirement Scenario'!G14","v":"Periods/Year"},{"$f":"'Retirement Scenario'!H14","v":"Yearly Total Cont."},"Order",null,"Today's Date",{"$f":"'Retirement Scenario'!M5","v":"2020-03-26"}]
[null,null,{"$f":"IF('Retirement Scenario'!C15=0,\"\",'Retirement Scenario'!C15)","v":""},{"$f":"IF('Retirement Scenario'!D15=0,\"\",'Retirement Scenario'!D15)","v":""},{"$f":"IF('Retirement Scenario'!E15=0,\"\",'Retirement Scenario'!E15)","v":""},{"$f":"IF('Retirement Scenario'!F15=0,\"\",'Retirement Scenario'!F15)","v":""},{"$f":"IF('Retirement Scenario'!G15=0,\"\",'Retirement Scenario'!G15)","v":""},{"$f":"IFERROR(F92*G92,\"\")","v":""},{"$f":"IF('Retirement Scenario'!I15=0,\"\",'Retirement Scenario'!I15)","v":""}]
[null,null,{"$f":"IF('Retirement Scenario'!C16=0,\"\",'Retirement Scenario'!C16)","v":""},{"$f":"IF('Retirement Scenario'!D16=0,\"\",'Retirement Scenario'!D16)","v":""},{"$f":"IF('Retirement Scenario'!E16=0,\"\",'Retirement Scenario'!E16)","v":""},{"$f":"IF('Retirement Scenario'!F16=0,\"\",'Retirement Scenario'!F16)","v":""},{"$f":"IF('Retirement Scenario'!G16=0,\"\",'Retirement Scenario'!G16)","v":""},{"$f":"IFERROR(F93*G93,\"\")","v":""},{"$f":"IF('Retirement Scenario'!I16=0,\"\",'Retirement Scenario'!I16)","v":""},null,"Marital Status",{"$f":"'Retirement Scenario'!M7","v":"Single"}]
[null,null,{"$f":"IF('Retirement Scenario'!C17=0,\"\",'Retirement Scenario'!C17)","v":""},{"$f":"IF('Retirement Scenario'!D17=0,\"\",'Retirement Scenario'!D17)","v":""},{"$f":"IF('Retirement Scenario'!E17=0,\"\",'Retirement Scenario'!E17)","v":""},{"$f":"IF('Retirement Scenario'!F17=0,\"\",'Retirement Scenario'!F17)","v":""},{"$f":"IF('Retirement Scenario'!G17=0,\"\",'Retirement Scenario'!G17)","v":""},"",{"$f":"IF('Retirement Scenario'!I17=0,\"\",'Retirement Scenario'!I17)","v":""}]
[null,null,{"$f":"IF('Retirement Scenario'!C18=0,\"\",'Retirement Scenario'!C18)","v":""},{"$f":"IF('Retirement Scenario'!D18=0,\"\",'Retirement Scenario'!D18)","v":""},{"$f":"IF('Retirement Scenario'!E18=0,\"\",'Retirement Scenario'!E18)","v":""},{"$f":"IF('Retirement Scenario'!F18=0,\"\",'Retirement Scenario'!F18)","v":""},{"$f":"IF('Retirement Scenario'!G18=0,\"\",'Retirement Scenario'!G18)","v":""},"",{"$f":"IF('Retirement Scenario'!I18=0,\"\",'Retirement Scenario'!I18)","v":""},null,"Annual Rate Assumptions"]
[null,null,{"$f":"IF('Retirement Scenario'!C19=0,\"\",'Retirement Scenario'!C19)","v":""},{"$f":"IF('Retirement Scenario'!D19=0,\"\",'Retirement Scenario'!D19)","v":""},{"$f":"IF('Retirement Scenario'!E19=0,\"\",'Retirement Scenario'!E19)","v":""},{"$f":"IF('Retirement Scenario'!F19=0,\"\",'Retirement Scenario'!F19)","v":""},{"$f":"IF('Retirement Scenario'!G19=0,\"\",'Retirement Scenario'!G19)","v":""},"",{"$f":"IF('Retirement Scenario'!I19=0,\"\",'Retirement Scenario'!I19)","v":""},null,{"$f":"IF('Retirement Scenario'!I36=0,\"\",'Retirement Scenario'!I36)","v":"Inflation Rate"},{"$f":"IF('Retirement Scenario'!J36=0,\"\",'Retirement Scenario'!J36)","v":0.03}]
[null,null,{"$f":"IF('Retirement Scenario'!C20=0,\"\",'Retirement Scenario'!C20)","v":""},{"$f":"IF('Retirement Scenario'!D20=0,\"\",'Retirement Scenario'!D20)","v":""},{"$f":"IF('Retirement Scenario'!E20=0,\"\",'Retirement Scenario'!E20)","v":""},{"$f":"IF('Retirement Scenario'!F20=0,\"\",'Retirement Scenario'!F20)","v":""},{"$f":"IF('Retirement Scenario'!G20=0,\"\",'Retirement Scenario'!G20)","v":""},"",{"$f":"IF('Retirement Scenario'!I20=0,\"\",'Retirement Scenario'!I20)","v":""},null,{"$f":"IF('Retirement Scenario'!I37=0,\"\",'Retirement Scenario'!I37)","v":"COLA"},{"$f":"IF('Retirement Scenario'!J37=0,\"\",'Retirement Scenario'!J37)","v":2.4999999999999998E-2}]
[null,null,null,null,{"$f":"SUM(E92:E97)","v":0},{"$f":"SUM(F92:F97)","v":0},{"$f":"MAX(G92:G97)","v":0},{"$f":"SUM(H92:H97)","v":0},null,null,{"$f":"IF('Retirement Scenario'!I38=0,\"\",'Retirement Scenario'!I38)","v":"Pre-Retirement ROR"},{"$f":"IF('Retirement Scenario'!J38=0,\"\",'Retirement Scenario'!J38)","v":0.06}]
[null,null,null,null,null,null,null,null,null,null,{"$f":"IF('Retirement Scenario'!I39=0,\"\",'Retirement Scenario'!I39)","v":"Post-Retirement ROR"},{"$f":"IF('Retirement Scenario'!J39=0,\"\",'Retirement Scenario'!J39)","v":0.04}]
[null,null,{"$f":"'Retirement Scenario'!C24","v":"'s Invested Assets Available Upon Retirement"},null,null,null,null,null,null,null,"Ret. Eff. Tax Rate",{"$f":"IF('Retirement Scenario'!J40=0,0,'Retirement Scenario'!J40)","v":0.12}]
[null,null,"Account Type","Detail","Balance","Contributions","Periods/Year","Yearly Total","Order"]
[null,null,{"$f":"IF('Retirement Scenario'!C26=0,\"\",'Retirement Scenario'!C26)","v":""},{"$f":"IF('Retirement Scenario'!D26=0,\"\",'Retirement Scenario'!D26)","v":""},{"$f":"IF('Retirement Scenario'!E26=0,\"\",'Retirement Scenario'!E26)","v":""},{"$f":"IF('Retirement Scenario'!F26=0,\"\",'Retirement Scenario'!F26)","v":""},{"$f":"IF('Retirement Scenario'!G26=0,\"\",'Retirement Scenario'!G26)","v":""},{"$f":"IFERROR(F102*G102,\"\")","v":""},{"$f":"IF('Retirement Scenario'!I26=0,\"\",'Retirement Scenario'!I26)","v":""}]
[null,null,{"$f":"IF('Retirement Scenario'!C27=0,\"\",'Retirement Scenario'!C27)","v":""},{"$f":"IF('Retirement Scenario'!D27=0,\"\",'Retirement Scenario'!D27)","v":""},{"$f":"IF('Retirement Scenario'!E27=0,\"\",'Retirement Scenario'!E27)","v":""},{"$f":"IF('Retirement Scenario'!F27=0,\"\",'Retirement Scenario'!F27)","v":""},{"$f":"IF('Retirement Scenario'!G27=0,\"\",'Retirement Scenario'!G27)","v":""},"",{"$f":"IF('Retirement Scenario'!I27=0,\"\",'Retirement Scenario'!I27)","v":""}]
[null,null,{"$f":"IF('Retirement Scenario'!C28=0,\"\",'Retirement Scenario'!C28)","v":""},{"$f":"IF('Retirement Scenario'!D28=0,\"\",'Retirement Scenario'!D28)","v":""},{"$f":"IF('Retirement Scenario'!E28=0,\"\",'Retirement Scenario'!E28)","v":""},{"$f":"IF('Retirement Scenario'!F28=0,\"\",'Retirement Scenario'!F28)","v":""},{"$f":"IF('Retirement Scenario'!G28=0,\"\",'Retirement Scenario'!G28)","v":""},"",{"$f":"IF('Retirement Scenario'!I28=0,\"\",'Retirement Scenario'!I28)","v":""}]
[null,null,{"$f":"IF('Retirement Scenario'!C29=0,\"\",'Retirement Scenario'!C29)","v":""},{"$f":"IF('Retirement Scenario'!D29=0,\"\",'Retirement Scenario'!D29)","v":""},{"$f":"IF('Retirement Scenario'!E29=0,\"\",'Retirement Scenario'!E29)","v":""},{"$f":"IF('Retirement Scenario'!F29=0,\"\",'Retirement Scenario'!F29)","v":""},{"$f":"IF('Retirement Scenario'!G29=0,\"\",'Retirement Scenario'!G29)","v":""},"",{"$f":"IF('Retirement Scenario'!I29=0,\"\",'Retirement Scenario'!I29)","v":""}]
[null,null,{"$f":"IF('Retirement Scenario'!C30=0,\"\",'Retirement Scenario'!C30)","v":""},{"$f":"IF('Retirement Scenario'!D30=0,\"\",'Retirement Scenario'!D30)","v":""},{"$f":"IF('Retirement Scenario'!E30=0,\"\",'Retirement Scenario'!E30)","v":""},{"$f":"IF('Retirement Scenario'!F30=0,\"\",'Retirement Scenario'!F30)","v":""},{"$f":"IF('Retirement Scenario'!G30=0,\"\",'Retirement Scenario'!G30)","v":""},"",{"$f":"IF('Retirement Scenario'!I30=0,\"\",'Retirement Scenario'!I30)","v":""}]
[null,null,{"$f":"IF('Retirement Scenario'!C31=0,\"\",'Retirement Scenario'!C31)","v":""},{"$f":"IF('Retirement Scenario'!D31=0,\"\",'Retirement Scenario'!D31)","v":""},{"$f":"IF('Retirement Scenario'!E31=0,\"\",'Retirement Scenario'!E31)","v":""},{"$f":"IF('Retirement Scenario'!F31=0,\"\",'Retirement Scenario'!F31)","v":""},{"$f":"IF('Retirement Scenario'!G31=0,\"\",'Retirement Scenario'!G31)","v":""},"",{"$f":"IF('Retirement Scenario'!I31=0,\"\",'Retirement Scenario'!I31)","v":""}]
[null,null,null,null,{"$f":"SUM(E102:E107)","v":0},{"$f":"SUM(F102:F107)","v":0},{"$f":"MAX(G102:G107)","v":0},{"$f":"SUM(H102:H107)","v":0},null,{"$f":"E98+E108","v":0}]
[]
[null,null,"Social Security Benefits"]
[null,null,null,62,67,70,"COLA Rate","Per Month","Per Year","COLA Adjusted"]
[null,null,{"$f":"IF($C$87>0,$C$87,\"\")","v":""},{"$f":"IF('Retirement Scenario'!D37=0,\"\",'Retirement Scenario'!D37)","v":""},{"$f":"IF('Retirement Scenario'!E37=0,\"\",'Retirement Scenario'!E37)","v":""},{"$f":"IF('Retirement Scenario'!F37=0,\"\",'Retirement Scenario'!F37)","v":""},{"$f":"L97","v":2.4999999999999998E-2},{"$f":"IF(H87=D111,D112,IF(H87=E111,E112,(IF(H87=F111,F112,0))))","v":0},{"$f":"H112*12","v":0},{"$f":"IFERROR(FV(G112,(H87-F87),0,-I112),0)","v":0}]
[null,null,{"$f":"IF($C$88>0,$C$88,\"\")","v":""},{"$f":"IF('Retirement Scenario'!D38=0,\"\",'Retirement Scenario'!D38)","v":""},{"$f":"IF('Retirement Scenario'!E38=0,\"\",'Retirement Scenario'!E38)","v":""},{"$f":"IF('Retirement Scenario'!F38=0,\"\",'Retirement Scenario'!F38)","v":""},{"$f":"L97","v":2.4999999999999998E-2},{"$f":"IF(H88=D111,D113,IF(H88=E111,E113,(IF(H88=F111,F113,0))))","v":0},{"$f":"H113*12","v":0},{"$f":"IFERROR(FV(G113,(H88-F88),0,-I113),\"\")","v":""}]
[]
[null,null,"Pension Benefits",null,"(Monthly)","(Yearly)","Inf. Adj. %","Inf. Adjusted"]
[null,null,{"$f":"IF($C$87>0,$C$87,\"\")","v":""},null,{"$f":"IF('Retirement Scenario'!D43=0,\"\",'Retirement Scenario'!D43)","v":""},{"$f":"IFERROR(E116*12,\"\")","v":""},{"$f":"'Retirement Scenario'!F43","v":0},{"$f":"IF(G116=0,F116,FV(G116,J87-F87,0,-F116))","v":""}]
[null,null,{"$f":"IF($C$88>0,$C$88,\"\")","v":""},null,{"$f":"IF('Retirement Scenario'!D44=0,\"\",'Retirement Scenario'!D44)","v":""},{"$f":"IFERROR(E117*12,\"\")","v":""},{"$f":"'Retirement Scenario'!F44","v":0},{"$f":"IFERROR(IF(G117=0,F117,FV(G117,J88-F88,0,-F117)),0)","v":""}]
[]
[null,null,"Income Sources (Projected)",null,"(Monthly)","(Yearly)","Term (yrs)","Beg. Date","End Year"]
[null,null,"Earned income",null,{"$f":"IF('Retirement Scenario'!D49=0,\"\",'Retirement Scenario'!D49)","v":""},{"$f":"IFERROR(E120*12,\"\")","v":""},{"$f":"IF('Retirement Scenario'!F49=0,\"\",'Retirement Scenario'!F49)","v":""},{"$f":"IF('Retirement Scenario'!G49=0,\"\",'Retirement Scenario'!G49)","v":""},{"$f":"IFERROR((G120-1)+H120,\"\")","v":""}]
[null,null,"Rental income",null,{"$f":"IF('Retirement Scenario'!D50=0,\"\",'Retirement Scenario'!D50)","v":""},{"$f":"IFERROR(E121*12,\"\")","v":""},{"$f":"IF('Retirement Scenario'!F50=0,\"\",'Retirement Scenario'!F50)","v":""},{"$f":"IF('Retirement Scenario'!G50=0,\"\",'Retirement Scenario'!G50)","v":""},{"$f":"IFERROR((G121-1)+H121,\"\")","v":""}]
[null,null,"Sale of major asset",null,{"$f":"IF('Retirement Scenario'!D51=0,\"\",'Retirement Scenario'!D51)","v":""},"",{"$f":"IF('Retirement Scenario'!F51=0,\"\",'Retirement Scenario'!F51)","v":""},{"$f":"IF('Retirement Scenario'!G51=0,\"\",'Retirement Scenario'!G51)","v":""},{"$f":"IFERROR((G122-1)+H122,\"\")","v":""}]
[null,null,"Other income",null,{"$f":"IF('Retirement Scenario'!D52=0,\"\",'Retirement Scenario'!D52)","v":""},"",{"$f":"IF('Retirement Scenario'!F52=0,\"\",'Retirement Scenario'!F52)","v":""},{"$f":"IF('Retirement Scenario'!G52=0,\"\",'Retirement Scenario'!G52)","v":""},""]
[]
[null,null,"Monthly Income Need",null,"(Monthly)","(Yearly)","Period (yrs)","Beg. Date","End Year"]
[null,null,"How much income is needed in retirement monthly? ",null,{"$f":"IF('Retirement Scenario'!E60=0,\"\",'Retirement Scenario'!E60)","v":""},{"$f":"IFERROR((E126*12)/(1-$L$100),\"\")","v":""},{"$f":"IF('Retirement Scenario'!G60=0,\"\",'Retirement Scenario'!G60)","v":""},{"$f":"IFERROR(IF(L93=\"Single\",INDEX(A135:C206,MATCH(G87,B135:B206,0),1),IFERROR(MIN(INDEX(A135:C206,MATCH(G87,B135:B206,0),1),INDEX(A135:C206,MATCH(G88,C135:C206,0),1)),\"\")),\"\")","v":2020},{"$f":"IFERROR(G126+H126,\"\")","v":""}]
[null,null,null,null,{"$f":"IF('Retirement Scenario'!E61=0,\"\",'Retirement Scenario'!E61)","v":""},{"$f":"IFERROR((E127*12)/(1-$L$100),\"\")","v":""},{"$f":"IF('Retirement Scenario'!G61=0,\"\",'Retirement Scenario'!G61)","v":""},{"$f":"IF(G127=\"\",\"\",I126+1)","v":""},{"$f":"IFERROR(G127+H127,\"\")","v":""}]
[null,null,"If the need changes over time, fill out multiple periods.",null,{"$f":"IF('Retirement Scenario'!E62=0,\"\",'Retirement Scenario'!E62)","v":""},"",{"$f":"IF('Retirement Scenario'!G62=0,\"\",'Retirement Scenario'!G62)","v":""},{"$f":"IF(G128=\"\",\"\",I127+1)","v":""},""]
[null,"Yes",null,null,{"$f":"IF('Retirement Scenario'!E63=0,\"\",'Retirement Scenario'!E63)","v":""},"",{"$f":"IF('Retirement Scenario'!G63=0,\"\",'Retirement Scenario'!G63)","v":""},"",""]
[null,"No",null,null,{"$f":"IF('Retirement Scenario'!E64=0,\"\",'Retirement Scenario'!E64)","v":""},"",{"$f":"IF('Retirement Scenario'!G64=0,\"\",'Retirement Scenario'!G64)","v":""},"",""]
[]
[]
[]
[]
[null,{"$f":"CONCATENATE($C$87,\"'s \",\"Age\")","v":"'s Age"},{"$f":"CONCATENATE($C$88,\"'s \",\"Age\")","v":"'s Age"},{"$f":"CONCATENATE($C$87,\"'s SS\")","v":"'s SS"},{"$f":"CONCATENATE($C$88,\"'s SS\")","v":"'s SS"},"SS Total",{"$f":"CONCATENATE($C$87,\"'s Pension\")","v":"'s Pension"},{"$f":"CONCATENATE($C$88,\"'s Pension\")","v":"'s Pension"},"Pension Total","Earned Income","Rental Income","Major Asset","Other Income","Other Total","Total Income","Need","Remainder","His Act. Balance","Her Act. Bal","Total Act Balance","His Rem. Bal","Her Rem. Bal","End of year assets"]
[{"$f":"YEAR(L91)","v":2020},{"$f":"F87","v":""},{"$f":"F88","v":""},{"$f":"IF(B136=$H$87,J112,0)","v":0},{"$f":"IF(C136=$H$88,J113,0)","v":""},{"$f":"SUM(D136:E136)","v":0},{"$f":"IF(B136=$J$87,H116,0)","v":""},{"$f":"IF(C136=$J$88,H117,0)","v":""},{"$f":"SUM(G136:H136)","v":0},{"$f":"IF(A136<H126,0,F120)","v":""},{"$f":"IF(A136<H121,0,F121)","v":0},{"$f":"IF(A136<H122,0,F122)","v":0},{"$f":"IF(A136<H123,0,F123)","v":0},{"$f":"SUM(J136:M136)","v":0},{"$f":"SUM(F136,I136,N136)","v":0},{"$f":"IF(A136<$H$126,0,-$F$126)","v":{"$error":"#VALUE!"}},{"$f":"SUM(O136:P136)","v":{"$error":"#VALUE!"}},{"$f":"SUMIF($3:$3, $C$87,INDEX($A$1:$C$82,MATCH(A136,$A$1:$A$82,0),0))","v":{"$error":"#N/A"}},{"$f":"IFERROR(SUMIF($3:$3, $C$88,INDEX($A$1:$C$82,MATCH(A136,$A$1:$A$82,0),0)),\"\")","v":""},{"$f":"SUM(R136:S136)","v":{"$error":"#N/A"}},{"$f":"SUMIF($4:$4, $C$87,INDEX($A$1:$C$82,MATCH(A136,$A$1:$A$82,0),0))","v":{"$error":"#VALUE!"}},{"$f":"IFERROR(SUMIF($4:$4, $C$88,INDEX($A$1:$C$82,MATCH(A136,$A$1:$A$82,0),0)),\"\")","v":""},{"$f":"SUM(U136:V136)","v":{"$error":"#VALUE!"}}]
[{"$f":"A136+1","v":2021},{"$f":"B136+1","v":{"$error":"#VALUE!"}},{"$f":"IFERROR(IF(C136=\"0\",\"\",C136+1),\"\")","v":""},{"$f":"IF(B137=$H$87,$J$112,IF(B137>$H$87,D136*(1+$G$112),IF(B137<$H$87,0,\"\")))","v":{"$error":"#VALUE!"}},{"$f":"IF(C137=$H$88,$J$113,IF(C137>$H$88,E136*(1+$G$113),IF(C137<$H$88,0,\"\")))","v":""},{"$f":"SUM(D137:E137)","v":{"$error":"#VALUE!"}},{"$f":"IF(B137<$J$87,0,IF(B137=$J$87,$H$116,IF(B137>$J$87,G136*(1+$G$116),\"\")))","v":{"$error":"#VALUE!"}},{"$f":"IF(C137<$J$88,0,IF(C137=$J$88,$H$117,IF(C137>$J$88,H136*(1+$G$117),\"\")))","v":""},{"$f":"SUM(G137:H137)","v":{"$error":"#VALUE!"}},{"$f":"IF(AND(A137>=$H$120,A137<=$I$120),FV($L$96,$H$120-$A$136,0,-$F$120),0)","v":0},{"$f":"IF(AND(A137>=$H$121,A137<=$I$121),FV($L$96,$H$121-$A$136,0,-$F$121),0)","v":0},{"$f":"IF(AND(A137>=$H$122,A137<=$I$122),FV($L$96,$H$122-$A$136,0,-$F$122),0)","v":0},{"$f":"IF(AND(A137>=$H$123,A137<=$I$123),FV($L$96,$H$123-$A$136,0,-$F$123),0)","v":0},{"$f":"SUM(J137:M137)","v":0},{"$f":"SUM(F137,I137,N137)","v":{"$error":"#VALUE!"}},{"$f":"IF(A137<$H$126,0,-FV($L$96,A137-$A$136,0,-(INDEX($F$126:$H$130,MATCH(A137,$H$126:$H$130,1),1))))","v":{"$error":"#VALUE!"}},{"$f":"SUM(O137:P137)","v":{"$error":"#VALUE!"}},{"$error":"#VALUE!"},{"$f":"IFERROR(SUMIF($3:$3, $C$88,INDEX($A$1:$C$82,MATCH(A137,$A$1:$A$82,0),0)),\"\")","v":""},{"$f":"SUM(R137:S137)","v":{"$error":"#VALUE!"}},{"$error":"#VALUE!"},{"$f":"IFERROR(SUMIF($4:$4, $C$88,INDEX($A$1:$C$82,MATCH(A137,$A$1:$A$82,0),0)),\"\")","v":""},{"$f":"SUM(U137:V137)","v":{"$error":"#VALUE!"}}]
[{"$f":"A137+1","v":2022},{"$error":"#VALUE!"},{"$f":"IFERROR(IF(C137=\"0\",\"\",C137+1),\"\")","v":""},{"$error":"#VALUE!"},"",{"$error":"#VALUE!"},{"$f":"IF(B138<$J$87,0,IF(B138=$J$87,$H$116,IF(B138>$J$87,G137*(1+$G$116),\"\")))","v":{"$error":"#VALUE!"}},{"$f":"IF(C138<$J$88,0,IF(C138=$J$88,$H$117,IF(C138>$J$88,H137*(1+$G$117),\"\")))","v":""},{"$error":"#VALUE!"},0,0,0,0,0,{"$error":"#VALUE!"},{"$error":"#VALUE!"},{"$error":"#VALUE!"},{"$error":"#VALUE!"},"",{"$error":"#VALUE!"},{"$error":"#VALUE!"},"",{"$error":"#VALUE!"}]
[2023,{"$error":"#VALUE!"},"",{"$error":"#VALUE!"},"",{"$error":"#VALUE!"},{"$error":"#VALUE!"},"",{"$error":"#VALUE!"},0,0,0,0,0,{"$error":"#VALUE!"},{"$error":"#VALUE!"},{"$error":"#VALUE!"},{"$error":"#VALUE!"},"",{"$error":"#VALUE!"},{"$error":"#VALUE!"},"",{"$error":"#VALUE!"}]
[2024,{"$error":"#VALUE!"},"",{"$error":"#VALUE!"},"",{"$error":"#VALUE!"},{"$error":"#VALUE!"},"",{"$error":"#VALUE!"},0,0,0,0,0,{"$error":"#VALUE!"},{"$error":"#VALUE!"},{"$error":"#VALUE!"},{"$error":"#VALUE!"},"",{"$error":"#VALUE!"},{"$error":"#VALUE!"},"",{"$error":"#VALUE!"}]
[2025,{"$error":"#VALUE!"},"",{"$error":"#VALUE!"},"",{"$error":"#VALUE!"},{"$error":"#VALUE!"},"",{"$error":"#VALUE!"},0,0,0,0,0,{"$error":"#VALUE!"},{"$error":"#VALUE!"},{"$error":"#VALUE!"},{"$error":"#VALUE!"},"",{"$error":"#VALUE!"},{"$error":"#VALUE!"},"",{"$error":"#VALUE!"}]
[2026,{"$error":"#VALUE!"},"",{"$error":"#VALUE!"},"",{"$error":"#VALUE!"},{"$error":"#VALUE!"},"",{"$error":"#VALUE!"},0,0,0,0,0,{"$error":"#VALUE!"},{"$error":"#VALUE!"},{"$error":"#VALUE!"},{"$error":"#VALUE!"},"",{"$error":"#VALUE!"},{"$error":"#VALUE!"},"",{"$error":"#VALUE!"}]
[2027,{"$error":"#VALUE!"},"",{"$error":"#VALUE!"},"",{"$error":"#VALUE!"},{"$error":"#VALUE!"},"",{"$error":"#VALUE!"},0,0,0,0,0,{"$error":"#VALUE!"},{"$error":"#VALUE!"},{"$error":"#VALUE!"},{"$error":"#VALUE!"},"",{"$error":"#VALUE!"},{"$error":"#VALUE!"},"",{"$error":"#VALUE!"}]
[2028,{"$error":"#VALUE!"},"",{"$error":"#VALUE!"},"",{"$error":"#VALUE!"},{"$error":"#VALUE!"},"",{"$error":"#VALUE!"},0,0,0,0,0,{"$error":"#VALUE!"},{"$error":"#VALUE!"},{"$error":"#VALUE!"},{"$error":"#VALUE!"},"",{"$error":"#VALUE!"},{"$error":"#VALUE!"},"",{"$error":"#VALUE!"}]
[2029,{"$error":"#VALUE!"},"",{"$error":"#VALUE!"},"",{"$error":"#VALUE!"},{"$error":"#VALUE!"},"",{"$error":"#VALUE!"},0,0,0,0,0,{"$error":"#VALUE!"},{"$error":"#VALUE!"},{"$error":"#VALUE!"},{"$error":"#VALUE!"},"",{"$error":"#VALUE!"},{"$error":"#VALUE!"},"",{"$error":"#VALUE!"}]
[2030,{"$error":"#VALUE!"},"",{"$error":"#VALUE!"},"",{"$error":"#VALUE!"},{"$error":"#VALUE!"},"",{"$error":"#VALUE!"},0,0,0,0,0,{"$error":"#VALUE!"},{"$error":"#VALUE!"},{"$error":"#VALUE!"},{"$error":"#VALUE!"},"",{"$error":"#VALUE!"},{"$error":"#VALUE!"},"",{"$error":"#VALUE!"}]
[2031,{"$error":"#VALUE!"},"",{"$error":"#VALUE!"},"",{"$error":"#VALUE!"},{"$error":"#VALUE!"},"",{"$error":"#VALUE!"},0,0,0,0,0,{"$error":"#VALUE!"},{"$error":"#VALUE!"},{"$error":"#VALUE!"},{"$error":"#VALUE!"},"",{"$error":"#VALUE!"},{"$error":"#VALUE!"},"",{"$error":"#VALUE!"}]
[2032,{"$error":"#VALUE!"},"",{"$error":"#VALUE!"},"",{"$error":"#VALUE!"},{"$error":"#VALUE!"},"",{"$error":"#VALUE!"},0,0,0,0,0,{"$error":"#VALUE!"},{"$error":"#VALUE!"},{"$error":"#VALUE!"},{"$error":"#VALUE!"},"",{"$error":"#VALUE!"},{"$error":"#VALUE!"},"",{"$error":"#VALUE!"}]
[2033,{"$error":"#VALUE!"},"",{"$error":"#VALUE!"},"",{"$error":"#VALUE!"},{"$error":"#VALUE!"},"",{"$error":"#VALUE!"},0,0,0,0,0,{"$error":"#VALUE!"},{"$error":"#VALUE!"},{"$error":"#VALUE!"},{"$error":"#VALUE!"},"",{"$error":"#VALUE!"},{"$error":"#VALUE!"},"",{"$error":"#VALUE!"}]
[2034,{"$error":"#VALUE!"},"",{"$error":"#VALUE!"},"",{"$error":"#VALUE!"},{"$error":"#VALUE!"},"",{"$error":"#VALUE!"},0,0,0,0,0,{"$error":"#VALUE!"},{"$error":"#VALUE!"},{"$error":"#VALUE!"},{"$error":"#VALUE!"},"",{"$error":"#VALUE!"},{"$error":"#VALUE!"},"",{"$error":"#VALUE!"}]
[2035,{"$error":"#VALUE!"},"",{"$error":"#VALUE!"},"",{"$error":"#VALUE!"},{"$error":"#VALUE!"},"",{"$error":"#VALUE!"},0,0,0,0,0,{"$error":"#VALUE!"},{"$error":"#VALUE!"},{"$error":"#VALUE!"},{"$error":"#VALUE!"},"",{"$error":"#VALUE!"},{"$error":"#VALUE!"},"",{"$error":"#VALUE!"}]
[2036,{"$error":"#VALUE!"},"",{"$error":"#VALUE!"},"",{"$error":"#VALUE!"},{"$error":"#VALUE!"},"",{"$error":"#VALUE!"},0,0,0,0,0,{"$error":"#VALUE!"},{"$error":"#VALUE!"},{"$error":"#VALUE!"},{"$error":"#VALUE!"},"",{"$error":"#VALUE!"},{"$error":"#VALUE!"},"",{"$error":"#VALUE!"}]
[2037,{"$error":"#VALUE!"},"",{"$error":"#VALUE!"},"",{"$error":"#VALUE!"},{"$error":"#VALUE!"},"",{"$error":"#VALUE!"},0,0,0,0,0,{"$error":"#VALUE!"},{"$error":"#VALUE!"},{"$error":"#VALUE!"},{"$error":"#VALUE!"},"",{"$error":"#VALUE!"},{"$error":"#VALUE!"},"",{"$error":"#VALUE!"}]
[{"$f":"A153+1","v":2038},{"$error":"#VALUE!"},"",{"$error":"#VALUE!"},"",{"$error":"#VALUE!"},{"$error":"#VALUE!"},"",{"$error":"#VALUE!"},0,0,0,0,0,{"$error":"#VALUE!"},{"$error":"#VALUE!"},{"$error":"#VALUE!"},{"$error":"#VALUE!"},"",{"$error":"#VALUE!"},{"$error":"#VALUE!"},"",{"$error":"#VALUE!"}]
[2039,{"$error":"#VALUE!"},"",{"$error":"#VALUE!"},"",{"$error":"#VALUE!"},{"$error":"#VALUE!"},"",{"$error":"#VALUE!"},0,0,0,0,0,{"$error":"#VALUE!"},{"$error":"#VALUE!"},{"$error":"#VALUE!"},{"$error":"#VALUE!"},"",{"$error":"#VALUE!"},{"$error":"#VALUE!"},"",{"$error":"#VALUE!"}]
[2040,{"$error":"#VALUE!"},"",{"$error":"#VALUE!"},"",{"$error":"#VALUE!"},{"$error":"#VALUE!"},"",{"$error":"#VALUE!"},0,0,0,0,0,{"$error":"#VALUE!"},{"$error":"#VALUE!"},{"$error":"#VALUE!"},{"$error":"#VALUE!"},"",{"$error":"#VALUE!"},{"$error":"#VALUE!"},"",{"$error":"#VALUE!"}]
[2041,{"$error":"#VALUE!"},"",{"$error":"#VALUE!"},"",{"$error":"#VALUE!"},{"$error":"#VALUE!"},"",{"$error":"#VALUE!"},0,0,0,0,0,{"$error":"#VALUE!"},{"$error":"#VALUE!"},{"$error":"#VALUE!"},{"$error":"#VALUE!"},"",{"$error":"#VALUE!"},{"$error":"#VALUE!"},"",{"$error":"#VALUE!"}]
[2042,{"$error":"#VALUE!"},"",{"$error":"#VALUE!"},"",{"$error":"#VALUE!"},{"$error":"#VALUE!"},"",{"$error":"#VALUE!"},0,0,0,0,0,{"$error":"#VALUE!"},{"$error":"#VALUE!"},{"$error":"#VALUE!"},{"$error":"#VALUE!"},"",{"$error":"#VALUE!"},{"$error":"#VALUE!"},"",{"$error":"#VALUE!"}]
[2043,{"$error":"#VALUE!"},"",{"$error":"#VALUE!"},"",{"$error":"#VALUE!"},{"$error":"#VALUE!"},"",{"$error":"#VALUE!"},0,0,0,0,0,{"$error":"#VALUE!"},{"$error":"#VALUE!"},{"$error":"#VALUE!"},{"$error":"#VALUE!"},"",{"$error":"#VALUE!"},{"$error":"#VALUE!"},"",{"$error":"#VALUE!"}]
[2044,{"$error":"#VALUE!"},"",{"$error":"#VALUE!"},"",{"$error":"#VALUE!"},{"$error":"#VALUE!"},"",{"$error":"#VALUE!"},0,0,0,0,0,{"$error":"#VALUE!"},{"$error":"#VALUE!"},{"$error":"#VALUE!"},{"$error":"#VALUE!"},"",{"$error":"#VALUE!"},{"$error":"#VALUE!"},"",{"$error":"#VALUE!"}]
[2045,{"$error":"#VALUE!"},"",{"$error":"#VALUE!"},"",{"$error":"#VALUE!"},{"$error":"#VALUE!"},"",{"$error":"#VALUE!"},0,0,0,0,0,{"$error":"#VALUE!"},{"$error":"#VALUE!"},{"$error":"#VALUE!"},{"$error":"#VALUE!"},"",{"$error":"#VALUE!"},{"$error":"#VALUE!"},"",{"$error":"#VALUE!"}]
[2046,{"$error":"#VALUE!"},"",{"$error":"#VALUE!"},"",{"$error":"#VALUE!"},{"$error":"#VALUE!"},"",{"$error":"#VALUE!"},0,0,0,0,0,{"$error":"#VALUE!"},{"$error":"#VALUE!"},{"$error":"#VALUE!"},{"$error":"#VALUE!"},"",{"$error":"#VALUE!"},{"$error":"#VALUE!"},"",{"$error":"#VALUE!"}]
[2047,{"$error":"#VALUE!"},"",{"$error":"#VALUE!"},"",{"$error":"#VALUE!"},{"$error":"#VALUE!"},"",{"$error":"#VALUE!"},0,0,0,0,0,{"$error":"#VALUE!"},{"$error":"#VALUE!"},{"$error":"#VALUE!"},{"$error":"#VALUE!"},"",{"$error":"#VALUE!"},{"$error":"#VALUE!"},"",{"$error":"#VALUE!"}]
[2048,{"$error":"#VALUE!"},"",{"$error":"#VALUE!"},"",{"$error":"#VALUE!"},{"$error":"#VALUE!"},"",{"$error":"#VALUE!"},0,0,0,0,0,{"$error":"#VALUE!"},{"$error":"#VALUE!"},{"$error":"#VALUE!"},{"$error":"#VALUE!"},"",{"$error":"#VALUE!"},{"$error":"#VALUE!"},"",{"$error":"#VALUE!"}]
[2049,{"$error":"#VALUE!"},"",{"$error":"#VALUE!"},"",{"$error":"#VALUE!"},{"$error":"#VALUE!"},"",{"$error":"#VALUE!"},0,0,0,0,0,{"$error":"#VALUE!"},{"$error":"#VALUE!"},{"$error":"#VALUE!"},{"$error":"#VALUE!"},"",{"$error":"#VALUE!"},{"$error":"#VALUE!"},"",{"$error":"#VALUE!"}]
[2050,{"$error":"#VALUE!"},"",{"$error":"#VALUE!"},"",{"$error":"#VALUE!"},{"$error":"#VALUE!"},"",{"$error":"#VALUE!"},0,0,0,0,0,{"$error":"#VALUE!"},{"$error":"#VALUE!"},{"$error":"#VALUE!"},{"$error":"#VALUE!"},"",{"$error":"#VALUE!"},{"$error":"#VALUE!"},"",{"$error":"#VALUE!"}]
[2051,{"$error":"#VALUE!"},"",{"$error":"#VALUE!"},"",{"$error":"#VALUE!"},{"$error":"#VALUE!"},"",{"$error":"#VALUE!"},0,0,0,0,0,{"$error":"#VALUE!"},{"$error":"#VALUE!"},{"$error":"#VALUE!"},{"$error":"#VALUE!"},"",{"$error":"#VALUE!"},{"$error":"#VALUE!"},"",{"$error":"#VALUE!"}]
[2052,{"$error":"#VALUE!"},"",{"$error":"#VALUE!"},"",{"$error":"#VALUE!"},{"$error":"#VALUE!"},"",{"$error":"#VALUE!"},0,0,0,0,0,{"$error":"#VALUE!"},{"$error":"#VALUE!"},{"$error":"#VALUE!"},{"$error":"#VALUE!"},"",{"$error":"#VALUE!"},{"$error":"#VALUE!"},"",{"$error":"#VALUE!"}]
[2053,{"$error":"#VALUE!"},"",{"$error":"#VALUE!"},"",{"$error":"#VALUE!"},{"$error":"#VALUE!"},"",{"$error":"#VALUE!"},0,0,0,0,0,{"$error":"#VALUE!"},{"$error":"#VALUE!"},{"$error":"#VALUE!"},{"$error":"#VALUE!"},"",{"$error":"#VALUE!"},{"$error":"#VALUE!"},"",{"$error":"#VALUE!"}]
[{"$f":"A169+1","v":2054},{"$error":"#VALUE!"},"",{"$error":"#VALUE!"},"",{"$error":"#VALUE!"},{"$error":"#VALUE!"},"",{"$error":"#VALUE!"},0,0,0,0,0,{"$error":"#VALUE!"},{"$error":"#VALUE!"},{"$error":"#VALUE!"},{"$error":"#VALUE!"},"",{"$error":"#VALUE!"},{"$error":"#VALUE!"},"",{"$error":"#VALUE!"}]
[2055,{"$error":"#VALUE!"},"",{"$error":"#VALUE!"},"",{"$error":"#VALUE!"},{"$error":"#VALUE!"},"",{"$error":"#VALUE!"},0,0,0,0,0,{"$error":"#VALUE!"},{"$error":"#VALUE!"},{"$error":"#VALUE!"},{"$error":"#VALUE!"},"",{"$error":"#VALUE!"},{"$error":"#VALUE!"},"",{"$error":"#VALUE!"}]
[2056,{"$error":"#VALUE!"},"",{"$error":"#VALUE!"},"",{"$error":"#VALUE!"},{"$error":"#VALUE!"},"",{"$error":"#VALUE!"},0,0,0,0,0,{"$error":"#VALUE!"},{"$error":"#VALUE!"},{"$error":"#VALUE!"},{"$error":"#VALUE!"},"",{"$error":"#VALUE!"},{"$error":"#VALUE!"},"",{"$error":"#VALUE!"}]
[2057,{"$error":"#VALUE!"},"",{"$error":"#VALUE!"},"",{"$error":"#VALUE!"},{"$error":"#VALUE!"},"",{"$error":"#VALUE!"},0,0,0,0,0,{"$error":"#VALUE!"},{"$error":"#VALUE!"},{"$error":"#VALUE!"},{"$error":"#VALUE!"},"",{"$error":"#VALUE!"},{"$error":"#VALUE!"},"",{"$error":"#VALUE!"}]
[2058,{"$error":"#VALUE!"},"",{"$error":"#VALUE!"},"",{"$error":"#VALUE!"},{"$error":"#VALUE!"},"",{"$error":"#VALUE!"},0,0,0,0,0,{"$error":"#VALUE!"},{"$error":"#VALUE!"},{"$error":"#VALUE!"},{"$error":"#VALUE!"},"",{"$error":"#VALUE!"},{"$error":"#VALUE!"},"",{"$error":"#VALUE!"}]
[2059,{"$error":"#VALUE!"},"",{"$error":"#VALUE!"},"",{"$error":"#VALUE!"},{"$error":"#VALUE!"},"",{"$error":"#VALUE!"},0,0,0,0,0,{"$error":"#VALUE!"},{"$error":"#VALUE!"},{"$error":"#VALUE!"},{"$error":"#VALUE!"},"",{"$error":"#VALUE!"},{"$error":"#VALUE!"},"",{"$error":"#VALUE!"}]
[2060,{"$error":"#VALUE!"},"",{"$error":"#VALUE!"},"",{"$error":"#VALUE!"},{"$error":"#VALUE!"},"",{"$error":"#VALUE!"},0,0,0,0,0,{"$error":"#VALUE!"},{"$error":"#VALUE!"},{"$error":"#VALUE!"},{"$error":"#VALUE!"},"",{"$error":"#VALUE!"},{"$error":"#VALUE!"},"",{"$error":"#VALUE!"}]
[2061,{"$error":"#VALUE!"},"",{"$error":"#VALUE!"},"",{"$error":"#VALUE!"},{"$error":"#VALUE!"},"",{"$error":"#VALUE!"},0,0,0,0,0,{"$error":"#VALUE!"},{"$error":"#VALUE!"},{"$error":"#VALUE!"},{"$error":"#VALUE!"},"",{"$error":"#VALUE!"},{"$error":"#VALUE!"},"",{"$error":"#VALUE!"}]
[2062,{"$error":"#VALUE!"},"",{"$error":"#VALUE!"},"",{"$error":"#VALUE!"},{"$error":"#VALUE!"},"",{"$error":"#VALUE!"},0,0,0,0,0,{"$error":"#VALUE!"},{"$error":"#VALUE!"},{"$error":"#VALUE!"},{"$error":"#VALUE!"},"",{"$error":"#VALUE!"},{"$error":"#VALUE!"},"",{"$error":"#VALUE!"}]
[2063,{"$error":"#VALUE!"},"",{"$error":"#VALUE!"},"",{"$error":"#VALUE!"},{"$error":"#VALUE!"},"",{"$error":"#VALUE!"},0,0,0,0,0,{"$error":"#VALUE!"},{"$error":"#VALUE!"},{"$error":"#VALUE!"},{"$error":"#VALUE!"},"",{"$error":"#VALUE!"},{"$error":"#VALUE!"},"",{"$error":"#VALUE!"}]
[2064,{"$error":"#VALUE!"},"",{"$error":"#VALUE!"},"",{"$error":"#VALUE!"},{"$error":"#VALUE!"},"",{"$error":"#VALUE!"},0,0,0,0,0,{"$error":"#VALUE!"},{"$error":"#VALUE!"},{"$error":"#VALUE!"},{"$error":"#VALUE!"},"",{"$error":"#VALUE!"},{"$error":"#VALUE!"},"",{"$error":"#VALUE!"}]
[2065,{"$error":"#VALUE!"},"",{"$error":"#VALUE!"},"",{"$error":"#VALUE!"},{"$error":"#VALUE!"},"",{"$error":"#VALUE!"},0,0,0,0,0,{"$error":"#VALUE!"},{"$error":"#VALUE!"},{"$error":"#VALUE!"},{"$error":"#VALUE!"},"",{"$error":"#VALUE!"},{"$error":"#VALUE!"},"",{"$error":"#VALUE!"}]
[2066,{"$error":"#VALUE!"},"",{"$error":"#VALUE!"},"",{"$error":"#VALUE!"},{"$error":"#VALUE!"},"",{"$error":"#VALUE!"},0,0,0,0,0,{"$error":"#VALUE!"},{"$error":"#VALUE!"},{"$error":"#VALUE!"},{"$error":"#VALUE!"},"",{"$error":"#VALUE!"},{"$error":"#VALUE!"},"",{"$error":"#VALUE!"}]
[2067,{"$error":"#VALUE!"},"",{"$error":"#VALUE!"},"",{"$error":"#VALUE!"},{"$error":"#VALUE!"},"",{"$error":"#VALUE!"},0,0,0,0,0,{"$error":"#VALUE!"},{"$error":"#VALUE!"},{"$error":"#VALUE!"},{"$error":"#VALUE!"},"",{"$error":"#VALUE!"},{"$error":"#VALUE!"},"",{"$error":"#VALUE!"}]
[2068,{"$error":"#VALUE!"},"",{"$error":"#VALUE!"},"",{"$error":"#VALUE!"},{"$error":"#VALUE!"},"",{"$error":"#VALUE!"},0,0,0,0,0,{"$error":"#VALUE!"},{"$error":"#VALUE!"},{"$error":"#VALUE!"},{"$error":"#VALUE!"},"",{"$error":"#VALUE!"},{"$error":"#VALUE!"},"",{"$error":"#VALUE!"}]
[2069,{"$error":"#VALUE!"},"",{"$error":"#VALUE!"},"",{"$error":"#VALUE!"},{"$error":"#VALUE!"},"",{"$error":"#VALUE!"},0,0,0,0,0,{"$error":"#VALUE!"},{"$error":"#VALUE!"},{"$error":"#VALUE!"},{"$error":"#VALUE!"},"",{"$error":"#VALUE!"},{"$error":"#VALUE!"},"",{"$error":"#VALUE!"}]
[{"$f":"A185+1","v":2070},{"$error":"#VALUE!"},"",{"$error":"#VALUE!"},"",{"$error":"#VALUE!"},{"$error":"#VALUE!"},"",{"$error":"#VALUE!"},0,0,0,0,0,{"$error":"#VALUE!"},{"$error":"#VALUE!"},{"$error":"#VALUE!"},{"$error":"#VALUE!"},"",{"$error":"#VALUE!"},{"$error":"#VALUE!"},"",{"$error":"#VALUE!"}]
[2071,{"$error":"#VALUE!"},"",{"$error":"#VALUE!"},"",{"$error":"#VALUE!"},{"$error":"#VALUE!"},"",{"$error":"#VALUE!"},0,0,0,0,0,{"$error":"#VALUE!"},{"$error":"#VALUE!"},{"$error":"#VALUE!"},{"$error":"#VALUE!"},"",{"$error":"#VALUE!"},{"$error":"#VALUE!"},"",{"$error":"#VALUE!"}]
[2072,{"$error":"#VALUE!"},"",{"$error":"#VALUE!"},"",{"$error":"#VALUE!"},{"$error":"#VALUE!"},"",{"$error":"#VALUE!"},0,0,0,0,0,{"$error":"#VALUE!"},{"$error":"#VALUE!"},{"$error":"#VALUE!"},{"$error":"#VALUE!"},"",{"$error":"#VALUE!"},{"$error":"#VALUE!"},"",{"$error":"#VALUE!"}]
[2073,{"$error":"#VALUE!"},"",{"$error":"#VALUE!"},"",{"$error":"#VALUE!"},{"$error":"#VALUE!"},"",{"$error":"#VALUE!"},0,0,0,0,0,{"$error":"#VALUE!"},{"$error":"#VALUE!"},{"$error":"#VALUE!"},{"$error":"#VALUE!"},"",{"$error":"#VALUE!"},{"$error":"#VALUE!"},"",{"$error":"#VALUE!"}]
[2074,{"$error":"#VALUE!"},"",{"$error":"#VALUE!"},"",{"$error":"#VALUE!"},{"$error":"#VALUE!"},"",{"$error":"#VALUE!"},0,0,0,0,0,{"$error":"#VALUE!"},{"$error":"#VALUE!"},{"$error":"#VALUE!"},{"$error":"#VALUE!"},"",{"$error":"#VALUE!"},{"$error":"#VALUE!"},"",{"$error":"#VALUE!"}]
[2075,{"$error":"#VALUE!"},"",{"$error":"#VALUE!"},"",{"$error":"#VALUE!"},{"$error":"#VALUE!"},"",{"$error":"#VALUE!"},0,0,0,0,0,{"$error":"#VALUE!"},{"$error":"#VALUE!"},{"$error":"#VALUE!"},{"$error":"#VALUE!"},"",{"$error":"#VALUE!"},{"$error":"#VALUE!"},"",{"$error":"#VALUE!"}]
[2076,{"$error":"#VALUE!"},"",{"$error":"#VALUE!"},"",{"$error":"#VALUE!"},{"$error":"#VALUE!"},"",{"$error":"#VALUE!"},0,0,0,0,0,{"$error":"#VALUE!"},{"$error":"#VALUE!"},{"$error":"#VALUE!"},{"$error":"#VALUE!"},"",{"$error":"#VALUE!"},{"$error":"#VALUE!"},"",{"$error":"#VALUE!"}]
[2077,{"$error":"#VALUE!"},"",{"$error":"#VALUE!"},"",{"$error":"#VALUE!"},{"$error":"#VALUE!"},"",{"$error":"#VALUE!"},0,0,0,0,0,{"$error":"#VALUE!"},{"$error":"#VALUE!"},{"$error":"#VALUE!"},{"$error":"#VALUE!"},"",{"$error":"#VALUE!"},{"$error":"#VALUE!"},"",{"$error":"#VALUE!"}]
[2078,{"$error":"#VALUE!"},"",{"$error":"#VALUE!"},"",{"$error":"#VALUE!"},{"$error":"#VALUE!"},"",{"$error":"#VALUE!"},0,0,0,0,0,{"$error":"#VALUE!"},{"$error":"#VALUE!"},{"$error":"#VALUE!"},{"$error":"#VALUE!"},"",{"$error":"#VALUE!"},{"$error":"#VALUE!"},"",{"$error":"#VALUE!"}]
[2079,{"$error":"#VALUE!"},"",{"$error":"#VALUE!"},"",{"$error":"#VALUE!"},{"$error":"#VALUE!"},"",{"$error":"#VALUE!"},0,0,0,0,0,{"$error":"#VALUE!"},{"$error":"#VALUE!"},{"$error":"#VALUE!"},{"$error":"#VALUE!"},"",{"$error":"#VALUE!"},{"$error":"#VALUE!"},"",{"$error":"#VALUE!"}]
[2080,{"$error":"#VALUE!"},"",{"$error":"#VALUE!"},"",{"$error":"#VALUE!"},{"$error":"#VALUE!"},"",{"$error":"#VALUE!"},0,0,0,0,0,{"$error":"#VALUE!"},{"$error":"#VALUE!"},{"$error":"#VALUE!"},{"$error":"#VALUE!"},"",{"$error":"#VALUE!"},{"$error":"#VALUE!"},"",{"$error":"#VALUE!"}]
[2081,{"$error":"#VALUE!"},"",{"$error":"#VALUE!"},"",{"$error":"#VALUE!"},{"$error":"#VALUE!"},"",{"$error":"#VALUE!"},0,0,0,0,0,{"$error":"#VALUE!"},{"$error":"#VALUE!"},{"$error":"#VALUE!"},{"$error":"#VALUE!"},"",{"$error":"#VALUE!"},{"$error":"#VALUE!"},"",{"$error":"#VALUE!"}]
[2082,{"$error":"#VALUE!"},"",{"$error":"#VALUE!"},"",{"$error":"#VALUE!"},{"$error":"#VALUE!"},"",{"$error":"#VALUE!"},0,0,0,0,0,{"$error":"#VALUE!"},{"$error":"#VALUE!"},{"$error":"#VALUE!"},{"$error":"#VALUE!"},"",{"$error":"#VALUE!"},{"$error":"#VALUE!"},"",{"$error":"#VALUE!"}]
[2083,{"$error":"#VALUE!"},"",{"$error":"#VALUE!"},"",{"$error":"#VALUE!"},{"$error":"#VALUE!"},"",{"$error":"#VALUE!"},0,0,0,0,0,{"$error":"#VALUE!"},{"$error":"#VALUE!"},{"$error":"#VALUE!"},{"$error":"#VALUE!"},"",{"$error":"#VALUE!"},{"$error":"#VALUE!"},"",{"$error":"#VALUE!"}]
[2084,{"$error":"#VALUE!"},"",{"$error":"#VALUE!"},"",{"$error":"#VALUE!"},{"$error":"#VALUE!"},"",{"$error":"#VALUE!"},0,0,0,0,0,{"$error":"#VALUE!"},{"$error":"#VALUE!"},{"$error":"#VALUE!"},{"$f":"SUMIF($3:$3, $C$87,INDEX($A$1:$C$82,MATCH(A200,$A$1:$A$82,0),0))","v":{"$error":"#VALUE!"}},"",{"$error":"#VALUE!"},{"$f":"SUMIF($4:$4, $C$87,INDEX($A$1:$C$82,MATCH(A200,$A$1:$A$82,0),0))","v":{"$error":"#VALUE!"}},"",{"$error":"#VALUE!"}]
[2085,{"$error":"#VALUE!"},"",{"$f":"IF(B201=$H$87,$J$112,IF(B201>$H$87,D200*(1+$G$112),IF(B201<$H$87,0,\"\")))","v":{"$error":"#VALUE!"}},{"$f":"IF(C201=$H$88,$J$113,IF(C201>$H$88,E200*(1+$G$113),IF(C201<$H$88,0,\"\")))","v":""},{"$f":"SUM(D201:E201)","v":{"$error":"#VALUE!"}},{"$error":"#VALUE!"},"",{"$f":"SUM(G201:H201)","v":{"$error":"#VALUE!"}},{"$f":"IF(AND(A201>=$H$120,A201<=$I$120),FV($L$96,$H$120-$A$136,0,-$F$120),0)","v":0},{"$f":"IF(AND(A201>=$H$121,A201<=$I$121),FV($L$96,$H$121-$A$136,0,-$F$121),0)","v":0},{"$f":"IF(AND(A201>=$H$122,A201<=$I$122),FV($L$96,$H$122-$A$136,0,-$F$122),0)","v":0},{"$f":"IF(AND(A201>=$H$123,A201<=$I$123),FV($L$96,$H$123-$A$136,0,-$F$123),0)","v":0},{"$f":"SUM(J201:M201)","v":0},{"$f":"SUM(F201,I201,N201)","v":{"$error":"#VALUE!"}},{"$f":"IF(A201<$H$126,0,-FV($L$96,A201-$A$136,0,-(INDEX($F$126:$H$130,MATCH(A201,$H$126:$H$130,1),1))))","v":{"$error":"#VALUE!"}},{"$f":"SUM(O201:P201)","v":{"$error":"#VALUE!"}},{"$error":"#VALUE!"},{"$f":"IFERROR(SUMIF($3:$3, $C$88,INDEX($A$1:$C$82,MATCH(A201,$A$1:$A$82,0),0)),\"\")","v":""},{"$f":"SUM(R201:S201)","v":{"$error":"#VALUE!"}},{"$error":"#VALUE!"},{"$f":"IFERROR(SUMIF($4:$4, $C$88,INDEX($A$1:$C$82,MATCH(A201,$A$1:$A$82,0),0)),\"\")","v":""},{"$f":"SUM(U201:V201)","v":{"$error":"#VALUE!"}}]
[{"$f":"A201+1","v":2086},{"$error":"#VALUE!"},{"$f":"IFERROR(IF(C201=\"0\",\"\",C201+1),\"\")","v":""},{"$error":"#VALUE!"},"",{"$error":"#VALUE!"},{"$f":"IF(B202<$J$87,0,IF(B202=$J$87,$H$116,IF(B202>$J$87,G201*(1+$G$116),\"\")))","v":{"$error":"#VALUE!"}},{"$f":"IF(C202<$J$88,0,IF(C202=$J$88,$H$117,IF(C202>$J$88,H201*(1+$G$117),\"\")))","v":""},{"$error":"#VALUE!"},0,0,0,0,0,{"$error":"#VALUE!"},{"$error":"#VALUE!"},{"$error":"#VALUE!"},{"$error":"#VALUE!"},"",{"$error":"#VALUE!"},{"$error":"#VALUE!"},"",{"$error":"#VALUE!"}]
[2087,{"$error":"#VALUE!"},"",{"$error":"#VALUE!"},"",{"$error":"#VALUE!"},{"$error":"#VALUE!"},"",{"$error":"#VALUE!"},0,0,0,0,0,{"$error":"#VALUE!"},{"$error":"#VALUE!"},{"$error":"#VALUE!"},{"$error":"#VALUE!"},"",{"$error":"#VALUE!"},{"$error":"#VALUE!"},"",{"$error":"#VALUE!"}]
[2088,{"$error":"#VALUE!"},"",{"$error":"#VALUE!"},"",{"$error":"#VALUE!"},{"$error":"#VALUE!"},"",{"$error":"#VALUE!"},0,0,0,0,0,{"$error":"#VALUE!"},{"$error":"#VALUE!"},{"$error":"#VALUE!"},{"$error":"#VALUE!"},"",{"$error":"#VALUE!"},{"$error":"#VALUE!"},"",{"$error":"#VALUE!"}]
[2089,{"$error":"#VALUE!"},"",{"$error":"#VALUE!"},"",{"$error":"#VALUE!"},{"$error":"#VALUE!"},"",{"$error":"#VALUE!"},0,0,0,0,0,{"$error":"#VALUE!"},{"$error":"#VALUE!"},{"$error":"#VALUE!"},{"$error":"#VALUE!"},"",{"$error":"#VALUE!"},{"$error":"#VALUE!"},"",{"$error":"#VALUE!"}]
[2090,{"$error":"#VALUE!"},"",{"$error":"#VALUE!"},"",{"$error":"#VALUE!"},{"$error":"#VALUE!"},"",{"$error":"#VALUE!"},0,0,0,0,0,{"$error":"#VALUE!"},{"$error":"#VALUE!"},{"$error":"#VALUE!"},{"$error":"#VALUE!"},"",{"$error":"#VALUE!"},{"$error":"#VALUE!"},"",{"$error":"#VALUE!"}]

{"sheet":"Debt Liquidation Sched","index":28,"n_rows":372,"n_cols":75,"rows_kept":372,"cut":false,"hidden":true,"merged":[]}
["DEBT LIQUIDATION SCHEDULE"]
[null,null,null,null,null,null,null,null,null,null,null,null,null,null,null,null,null,null,null,null,null,null,null,null,null,null,null,null,null,null,null,null,null,null,null,null,null,null,null,null,null,null,null,null,null,null,null,null,null,null,null,null,null,null,null,null,null,null,null,null,null,null,null,null,null,null,null,null,null,null,null,null,"Key:"]
[1,null,null,null,null,null,2,null,null,null,null,null,3,null,null,null,null,null,4,null,null,null,null,null,5,null,null,null,null,null,6,null,null,null,null,null,7,null,null,null,null,null,8,null,null,null,null,null,9,null,null,null,null,null,10,null,null,null,null,null,11,null,null,null,null,null,12]
["ACCOUNT NAME:",null,{"$f":"IF('Debt Page'!B9=0,\"\",('Debt Page'!B9))","v":""},null,null,null,"ACCOUNT NAME:",null,{"$f":"IF('Debt Page'!B10=0,\"\",('Debt Page'!B10))","v":""},null,null,null,"ACCOUNT NAME:",null,{"$f":"IF('Debt Page'!B11=0,\"\",('Debt Page'!B11))","v":""},null,null,null,"ACCOUNT NAME:",null,{"$f":"IF('Debt Page'!B12=0,\"\",('Debt Page'!B12))","v":""},null,null,null,"ACCOUNT NAME:",null,{"$f":"IF('Debt Page'!B13=0,\"\",('Debt Page'!B13))","v":""},null,null,null,"ACCOUNT NAME:",null,{"$f":"IF('Debt Page'!B14=0,\"\",('Debt Page'!B14))","v":""},null,null,null,"ACCOUNT NAME:",null,{"$f":"IF('Debt Page'!B15=0,\"\",('Debt Page'!B15))","v":""},null,null,null,"ACCOUNT NAME:",null,{"$f":"IF('Debt Page'!B16=0,\"\",('Debt Page'!B16))","v":""},null,null,null,"ACCOUNT NAME:",null,{"$f":"IF('Debt Page'!B17=0,\"\",('Debt Page'!B17))","v":""},null,null,null,"ACCOUNT NAME:",null,{"$f":"IF('Debt Page'!B18=0,\"\",('Debt Page'!B18))","v":""},null,null,null,"ACCOUNT NAME:",null,{"$f":"IF('Debt Page'!B19=0,\"\",('Debt Page'!B19))","v":""},null,null,null,"ACCOUNT NAME:",null,{"$f":"IF('Debt Page'!B20=0,\"\",('Debt Page'!B20))","v":""},null,null,null,null,null,"Name & Date"]
["BALANCE:",null,null,{"$f":"'Debt Page'!C9","v":0},null,null,"BALANCE:",null,null,{"$f":"'Debt Page'!C10","v":0},null,null,"BALANCE:",null,null,{"$f":"'Debt Page'!C11","v":0},null,null,"BALANCE:",null,null,{"$f":"'Debt Page'!C12","v":0},null,null,"BALANCE:",null,null,{"$f":"'Debt Page'!C13","v":0},null,null,"BALANCE:",null,null,{"$f":"'Debt Page'!C14","v":0},null,null,"BALANCE:",null,null,{"$f":"'Debt Page'!C15","v":0},null,null,"BALANCE:",null,null,{"$f":"'Debt Page'!C16","v":0},null,null,"BALANCE:",null,null,{"$f":"'Debt Page'!C17","v":0},null,null,"BALANCE:",null,null,{"$f":"'Debt Page'!C18","v":0},null,null,"BALANCE:",null,null,{"$f":"'Debt Page'!C19","v":0},null,null,"BALANCE:",null,null,{"$f":"'Debt Page'!C20","v":0}]
["INTEREST:",null,null,{"$f":"E6/12","v":0},{"$f":"'Debt Page'!D9","v":0},null,"INTEREST:",null,null,{"$f":"K6/12","v":0},{"$f":"'Debt Page'!D10","v":0},null,"INTEREST:",null,null,{"$f":"Q6/12","v":0},{"$f":"'Debt Page'!D11","v":0},null,"INTEREST:",null,null,{"$f":"W6/12","v":0},{"$f":"'Debt Page'!D12","v":0},null,"INTEREST:",null,null,{"$f":"AC6/12","v":0},{"$f":"'Debt Page'!D13","v":0},null,"INTEREST:",null,null,{"$f":"AI6/12","v":0},{"$f":"'Debt Page'!D14","v":0},null,"INTEREST:",null,null,{"$f":"AO6/12","v":0},{"$f":"'Debt Page'!D15","v":0},null,"INTEREST:",null,null,{"$f":"AU6/12","v":0},{"$f":"'Debt Page'!D16","v":0},null,"INTEREST:",null,null,{"$f":"BA6/12","v":0},{"$f":"'Debt Page'!D17","v":0},null,"INTEREST:",null,null,{"$f":"BG6/12","v":0},{"$f":"'Debt Page'!D18","v":0},null,"INTEREST:",null,null,{"$f":"BM6/12","v":0},{"$f":"'Debt Page'!D19","v":0},null,"INTEREST:",null,null,{"$f":"BS6/12","v":0},{"$f":"'Debt Page'!D20","v":0},null,null,null,"Balance of credit card"]
["SCHEDULED PMT:",null,{"$f":"D7/D5","v":{"$error":"#DIV/0!"}},{"$f":"'Debt Page'!E9","v":0},null,null,"SCHEDULED PMT:",null,{"$f":"J7/J5","v":{"$error":"#DIV/0!"}},{"$f":"'Debt Page'!E10","v":0},null,null,"SCHEDULED PMT:",null,{"$f":"P7/P5","v":{"$error":"#DIV/0!"}},{"$f":"'Debt Page'!E11","v":0},null,null,"SCHEDULED PMT:",null,{"$f":"V7/V5","v":{"$error":"#DIV/0!"}},{"$f":"'Debt Page'!E12","v":0},null,null,"SCHEDULED PMT:",null,{"$f":"AB7/AB5","v":{"$error":"#DIV/0!"}},{"$f":"'Debt Page'!E13","v":0},null,null,"SCHEDULED PMT:",null,{"$f":"AH7/AH5","v":{"$error":"#DIV/0!"}},{"$f":"'Debt Page'!E14","v":0},null,null,"SCHEDULED PMT:",null,{"$f":"AN7/AN5","v":{"$error":"#DIV/0!"}},{"$f":"'Debt Page'!E15","v":0},null,null,"SCHEDULED PMT:",null,{"$f":"AT7/AT5","v":{"$error":"#DIV/0!"}},{"$f":"'Debt Page'!E16","v":0},null,null,"SCHEDULED PMT:",null,{"$f":"AZ7/AZ5","v":{"$error":"#DIV/0!"}},{"$f":"'Debt Page'!E17","v":0},null,null,"SCHEDULED PMT:",null,{"$f":"BF7/BF5","v":{"$error":"#DIV/0!"}},{"$f":"'Debt Page'!E18","v":0},null,null,"SCHEDULED PMT:",null,{"$f":"BL7/BL5","v":{"$error":"#DIV/0!"}},{"$f":"'Debt Page'!E19","v":0},null,null,"SCHEDULED PMT:",null,{"$f":"BR7/BR5","v":{"$error":"#DIV/0!"}},{"$f":"'Debt Page'!E20","v":0}]
[null,null,null,null,"END",null,null,null,null,null,"END",null,null,null,null,null,"END",null,null,null,null,null,"END",null,null,null,null,null,"END",null,null,null,null,null,"END",null,null,null,null,null,"END",null,null,null,null,null,"END",null,null,null,null,null,"END",null,null,null,null,null,"END",null,null,null,null,null,"END",null,null,null,null,null,"END",null,null,null,"Interest rate - APR%"]
["MO","BAL","INT","PMT","BAL",null,"MO","BAL","INT","PMT","BAL",null,"MO","BAL","INT","PMT","BAL",null,"MO","BAL","INT","PMT","BAL",null,"MO","BAL","INT","PMT","BAL",null,"MO","BAL","INT","PMT","BAL",null,"MO","BAL","INT","PMT","BAL",null,"MO","BAL","INT","PMT","BAL",null,"MO","BAL","INT","PMT","BAL",null,"MO","BAL","INT","PMT","BAL",null,"MO","BAL","INT","PMT","BAL",null,"MO","BAL","INT","PMT","BAL"]
[null,null,null,null,null,null,null,null,null,null,null,null,null,null,null,null,null,null,null,null,null,null,null,null,null,null,null,null,null,null,null,null,null,null,null,null,null,null,null,null,null,null,null,null,null,null,null,null,null,null,null,null,null,null,null,null,null,null,null,null,null,null,null,null,null,null,null,null,null,null,null,null,null,null,"Scheduled payment"]
[1,{"$f":"D5","v":0},{"$f":"B11*$D$6","v":0},{"$f":"$D$7","v":0},{"$f":"IF((B11+C11-D11)>0,B11+C11-D11,0)","v":0},null,1,{"$f":"J5","v":0},{"$f":"H11*$J$6","v":0},{"$f":"$J$7","v":0},{"$f":"IF((H11+I11-J11)>0,H11+I11-J11,0)","v":0},null,1,{"$f":"P5","v":0},{"$f":"N11*$P$6","v":0},{"$f":"$P$7","v":0},{"$f":"IF((N11+O11-P11)>0,N11+O11-P11,0)","v":0},null,1,{"$f":"V5","v":0},{"$f":"T11*$V$6","v":0},{"$f":"$V$7","v":0},{"$f":"IF((T11+U11-V11)>0,T11+U11-V11,0)","v":0},null,1,{"$f":"AB5","v":0},{"$f":"Z11*$AB$6","v":0},{"$f":"$AB$7","v":0},{"$f":"IF((Z11+AA11-AB11)>0,Z11+AA11-AB11,0)","v":0},null,1,{"$f":"AH5","v":0},{"$f":"AF11*$AH$6","v":0},{"$f":"$AH$7","v":0},{"$f":"IF((AF11+AG11-AH11)>0,AF11+AG11-AH11,0)","v":0},null,1,{"$f":"AN5","v":0},{"$f":"AL11*$AN$6","v":0},{"$f":"$AN$7","v":0},{"$f":"IF((AL11+AM11-AN11)>0,AL11+AM11-AN11,0)","v":0},null,1,{"$f":"AT5","v":0},{"$f":"AR11*$AT$6","v":0},{"$f":"$AT$7","v":0},{"$f":"IF((AR11+AS11-AT11)>0,AR11+AS11-AT11,0)","v":0},null,1,{"$f":"AZ5","v":0},{"$f":"AX11*$AZ$6","v":0},{"$f":"$AZ$7","v":0},{"$f":"IF((AX11+AY11-AZ11)>0,AX11+AY11-AZ11,0)","v":0},null,1,{"$f":"BF5","v":0},{"$f":"BD11*$BF$6","v":0},{"$f":"$BF$7","v":0},{"$f":"IF((BD11+BE11-BF11)>0,BD11+BE11-BF11,0)","v":0},null,1,{"$f":"BL5","v":0},{"$f":"BJ11*$BL$6","v":0},{"$f":"$BL$7","v":0},{"$f":"IF((BJ11+BK11-BL11)>0,BJ11+BK11-BL11,0)","v":0},null,1,{"$f":"BR5","v":0},{"$f":"BP11*$BR$6","v":0},{"$f":"$BR$7","v":0},{"$f":"IF((BP11+BQ11-BR11)>0,BP11+BQ11-BR11,0)","v":0}]
[2,{"$f":"E11","v":0},{"$f":"B12*$D$6","v":0},{"$f":"IF((E11)>0,$D$7,0)","v":0},{"$f":"IF((B12+C12-D12)>0,B12+C12-D12,0)","v":0},null,2,{"$f":"K11","v":0},{"$f":"H12*$J$6","v":0},{"$f":"IF((K11)>0,IF(E11=0,$J$7+$D$7,$J$7),0)","v":0},{"$f":"IF((H12+I12-J12)>0,H12+I12-J12,0)","v":0},null,2,{"$f":"Q11","v":0},{"$f":"N12*$P$6","v":0},{"$f":"IF((Q11)>0,IF(K11=0,$P$7+$J$7+$D$7,$P$7),0)","v":0},{"$f":"IF((N12+O12-P12)>0,N12+O12-P12,0)","v":0},null,2,{"$f":"W11","v":0},{"$f":"T12*$V$6","v":0},{"$f":"IF((W11)>0,IF(Q11=0,$P$7+$J$7+$D$7+$V$7,$V$7),0)","v":0},{"$f":"IF((T12+U12-V12)>0,T12+U12-V12,0)","v":0},null,2,{"$f":"AC11","v":0},{"$f":"Z12*$AB$6","v":0},{"$f":"IF((AC11)>0,IF(W11=0,$AB$7+$V$7+$P$7+$J$7+$D$7,$AB$7),0)","v":0},{"$f":"IF((Z12+AA12-AB12)>0,Z12+AA12-AB12,0)","v":0},null,2,{"$f":"AI11","v":0},{"$f":"AF12*$AH$6","v":0},{"$f":"IF((AI11)>0,IF(AC11=0,$AH$7+$AB$7+$V$7+$P$7+$J$7+$D$7,$AH$7),0)","v":0},{"$f":"IF((AF12+AG12-AH12)>0,AF12+AG12-AH12,0)","v":0},null,2,{"$f":"AO11","v":0},{"$f":"AL12*$AN$6","v":0},{"$f":"IF((AO11)>0,IF(AI11=0,$AN$7+$AH$7+$AB$7+$V$7+$P$7+$J$7+$D$7,$AN$7),0)","v":0},{"$f":"IF((AL12+AM12-AN12)>0,AL12+AM12-AN12,0)","v":0},null,2,{"$f":"AU11","v":0},{"$f":"AR12*$AT$6","v":0},{"$f":"IF((AU11)>0,IF(AO11=0,$AT$7+$AN$7+$AH$7+$AB$7+$V$7+$P$7+$J$7+$D$7,$AT$7),0)","v":0},{"$f":"IF((AR12+AS12-AT12)>0,AR12+AS12-AT12,0)","v":0},null,2,{"$f":"BA11","v":0},{"$f":"AX12*$AZ$6","v":0},{"$f":"IF((BA11)>0,IF(AU11=0,$AZ$7+$AT$7+$AN$7+$AH$7+$AB$7+$V$7+$P$7+$J$7+$D$7,$AZ$7),0)","v":0},{"$f":"IF((AX12+AY12-AZ12)>0,AX12+AY12-AZ12,0)","v":0},null,2,{"$f":"BG11","v":0},{"$f":"BD12*$BF$6","v":0},{"$f":"IF((BG11)>0,IF(BA11=0,$BF$7+$AZ$7+$AT$7+$AN$7+$AH$7+$AB$7+$V$7+$P$7+$J$7+$D$7,$BF$7),0)","v":0},{"$f":"IF((BD12+BE12-BF12)>0,BD12+BE12-BF12,0)","v":0},null,2,{"$f":"BM11","v":0},{"$f":"BJ12*$BL$6","v":0},{"$f":"IF((BM11)>0,IF(BG11=0,$BL$7+$BF$7+$AZ$7+$AT$7+$AN$7+$AH$7+$AB$7+$V$7+$P$7+$J$7+$D$7,$BL$7),0)","v":0},{"$f":"IF((BJ12+BK12-BL12)>0,BJ12+BK12-BL12,0)","v":0},null,2,{"$f":"BS11","v":0},{"$f":"BP12*$BR$6","v":0},{"$f":"IF((BS11)>0,IF(BM11=0,$BR$7+$BL$7+$BF$7+$AZ$7+$AT$7+$AN$7+$AH$7+$AB$7+$V$7+$P$7+$J$7+$D$7,$BR$7),0)","v":0},{"$f":"IF((BP12+BQ12-BR12)>0,BP12+BQ12-BR12,0)","v":0}]
[3,{"$f":"E12","v":0},{"$f":"B13*$D$6","v":0},{"$f":"IF((E12)>0,$D$7,0)","v":0},0,null,3,{"$f":"K12","v":0},{"$f":"H13*$J$6","v":0},{"$f":"IF((K12)>0,IF(E12=0,$J$7+$D$7,$J$7),0)","v":0},0,null,3,{"$f":"Q12","v":0},{"$f":"N13*$P$6","v":0},{"$f":"IF((Q12)>0,IF(K12=0,$P$7+$J$7+$D$7,$P$7),0)","v":0},0,null,3,{"$f":"W12","v":0},0,{"$f":"IF((W12)>0,IF(Q12=0,$P$7+$J$7+$D$7+$V$7,$V$7),0)","v":0},0,null,3,{"$f":"AC12","v":0},0,{"$f":"IF((AC12)>0,IF(W12=0,$AB$7+$V$7+$P$7+$J$7+$D$7,$AB$7),0)","v":0},0,null,3,{"$f":"AI12","v":0},0,{"$f":"IF((AI12)>0,IF(AC12=0,$AH$7+$AB$7+$V$7+$P$7+$J$7+$D$7,$AH$7),0)","v":0},0,null,3,{"$f":"AO12","v":0},0,{"$f":"IF((AO12)>0,IF(AI12=0,$AN$7+$AH$7+$AB$7+$V$7+$P$7+$J$7+$D$7,$AN$7),0)","v":0},{"$f":"IF((AL13+AM13-AN13)>0,AL13+AM13-AN13,0)","v":0},null,3,{"$f":"AU12","v":0},0,{"$f":"IF((AU12)>0,IF(AO12=0,$AT$7+$AN$7+$AH$7+$AB$7+$V$7+$P$7+$J$7+$D$7,$AT$7),0)","v":0},0,null,3,{"$f":"BA12","v":0},0,{"$f":"IF((BA12)>0,IF(AU12=0,$AZ$7+$AT$7+$AN$7+$AH$7+$AB$7+$V$7+$P$7+$J$7+$D$7,$AZ$7),0)","v":0},0,null,3,{"$f":"BG12","v":0},0,{"$f":"IF((BG12)>0,IF(BA12=0,$BF$7+$AZ$7+$AT$7+$AN$7+$AH$7+$AB$7+$V$7+$P$7+$J$7+$D$7,$BF$7),0)","v":0},0,null,3,{"$f":"BM12","v":0},0,{"$f":"IF((BM12)>0,IF(BG12=0,$BL$7+$BF$7+$AZ$7+$AT$7+$AN$7+$AH$7+$AB$7+$V$7+$P$7+$J$7+$D$7,$BL$7),0)","v":0},0,null,3,{"$f":"BS12","v":0},0,{"$f":"IF((BS12)>0,IF(BM12=0,$BR$7+$BL$7+$BF$7+$AZ$7+$AT$7+$AN$7+$AH$7+$AB$7+$V$7+$P$7+$J$7+$D$7,$BR$7),0)","v":0},0]
[4,0,0,0,0,null,4,0,0,0,0,null,4,0,0,0,0,null,4,0,0,0,0,null,4,0,0,0,0,null,4,0,0,0,0,null,4,0,0,0,0,null,4,0,0,0,0,null,4,0,0,0,0,null,4,0,0,0,0,null,4,0,0,0,0,null,4,0,0,0,0]
[5,0,0,0,0,null,5,0,0,0,0,null,5,0,0,0,0,null,5,0,0,0,0,null,5,0,0,0,0,null,5,0,0,0,0,null,5,0,0,0,0,null,5,0,0,0,0,null,5,0,0,0,0,null,5,0,0,0,0,null,5,0,0,0,0,null,5,0,0,0,0]
[6,0,0,0,0,null,6,0,0,0,0,null,6,0,0,0,0,null,6,0,0,0,0,null,6,0,0,0,0,null,6,0,0,0,0,null,6,0,0,0,0,null,6,0,0,0,0,null,6,0,0,0,0,null,6,0,0,{"$f":"IF((BG15)>0,IF(BA15=0,$BF$7+$AZ$7+$AT$7+$AN$7+$AH$7+$AB$7+$V$7+$P$7+$J$7+$D$7,$BF$7),0)","v":0},0,null,6,0,0,0,0,null,6,0,0,0,0]
[7,0,0,0,0,null,7,0,0,0,0,null,7,0,0,0,0,null,7,0,0,0,0,null,7,0,0,0,0,null,7,0,0,0,0,null,7,0,0,0,0,null,7,0,0,0,0,null,7,0,0,0,0,null,7,0,0,0,0,null,7,0,0,0,0,null,7,0,0,0,0]
[8,0,0,0,0,null,8,0,0,0,0,null,8,0,0,0,0,null,8,0,0,0,0,null,8,0,0,0,0,null,8,0,0,0,0,null,8,0,0,0,0,null,8,0,0,0,0,null,8,0,0,0,0,null,8,0,0,0,0,null,8,0,0,0,0,null,8,0,0,0,0]
[9,0,0,0,0,null,9,0,0,0,0,null,9,0,0,0,0,null,9,0,0,0,0,null,9,0,0,0,0,null,9,0,0,0,0,null,9,0,0,0,0,null,9,0,0,0,0,null,9,0,0,0,0,null,9,0,0,0,0,null,9,0,0,0,0,null,9,0,0,0,0]
[10,0,0,0,0,null,10,0,0,0,0,null,10,0,0,0,0,null,10,0,0,0,0,null,10,0,0,0,0,null,10,0,0,0,0,null,10,0,0,0,0,null,10,0,0,0,0,null,10,0,0,0,0,null,10,0,0,0,0,null,10,0,0,0,0,null,10,0,0,0,0]
[11,0,0,0,0,null,11,0,0,0,0,null,11,0,0,0,0,null,11,0,0,0,0,null,11,0,0,0,0,null,11,0,0,0,0,null,11,0,0,0,0,null,11,0,0,0,0,null,11,0,0,0,0,null,11,0,0,0,0,null,11,0,0,{"$f":"IF((BM20)>0,IF(BG20=0,$BL$7+$BF$7+$AZ$7+$AT$7+$AN$7+$AH$7+$AB$7+$V$7+$P$7+$J$7+$D$7,$BL$7),0)","v":0},0,null,11,0,0,0,0]
[12,0,0,0,0,null,12,0,0,0,0,null,12,0,0,0,0,null,12,0,0,0,0,null,12,0,0,0,0,null,12,0,0,0,0,null,12,0,0,0,0,null,12,0,0,0,0,null,12,0,0,0,0,null,12,0,0,0,0,null,12,0,0,0,0,null,12,0,0,0,0]
[13,0,0,0,0,null,13,0,0,0,0,null,13,0,0,0,0,null,13,0,0,0,0,null,13,0,0,0,0,null,13,0,0,0,0,null,13,0,0,0,0,null,13,0,0,0,0,null,13,0,0,0,0,null,13,0,0,0,0,null,13,0,0,0,0,null,13,0,0,0,0]
[14,0,0,0,0,null,14,0,0,0,0,null,14,0,0,0,0,null,14,0,0,0,0,null,14,0,0,0,0,null,14,0,0,0,0,null,14,0,0,0,0,null,14,0,0,0,0,null,14,0,0,0,0,null,14,0,0,0,0,null,14,0,0,0,0,null,14,0,0,0,0]
[15,0,0,0,0,null,15,0,0,0,0,null,15,0,0,0,0,null,15,0,0,0,0,null,15,0,0,0,0,null,15,0,0,0,0,null,15,0,0,0,{"$f":"IF((AL25+AM25-AN25)>0,AL25+AM25-AN25,0)","v":0},null,15,0,0,0,0,null,15,0,0,0,0,null,15,0,0,0,0,null,15,0,0,0,0,null,15,0,0,0,0]
[16,0,0,0,0,null,16,0,0,0,0,null,16,0,0,0,0,null,16,0,0,0,0,null,16,0,0,0,0,null,16,0,0,0,0,null,16,0,0,0,0,null,16,0,0,0,0,null,16,0,0,0,0,null,16,0,0,0,0,null,16,0,0,0,0,null,16,0,0,0,0]
[17,0,0,0,0,null,17,0,0,0,0,null,17,0,0,0,0,null,17,0,0,0,0,null,17,0,0,0,0,null,17,0,0,0,0,null,17,0,0,0,0,null,17,0,0,0,0,null,17,0,0,0,0,null,17,0,0,0,0,null,17,0,0,0,0,null,17,0,0,0,0]
[18,0,0,0,0,null,18,0,0,0,0,null,18,0,0,0,0,null,18,0,0,0,0,null,18,0,0,0,0,null,18,0,0,0,0,null,18,0,0,0,0,null,18,0,0,0,0,null,18,0,0,0,0,null,18,0,0,0,0,null,18,0,0,0,0,null,18,0,0,0,0]
[19,0,0,0,0,null,19,0,0,0,0,null,19,0,0,0,0,null,19,0,0,0,{"$f":"IF((T29+U29-V29)>0,T29+U29-V29,0)","v":0},null,19,0,0,0,0,null,19,0,0,0,0,null,19,0,0,0,0,null,19,0,0,0,0,null,19,0,0,{"$f":"IF((BA28)>0,IF(AU28=0,$AZ$7+$AT$7+$AN$7+$AH$7+$AB$7+$V$7+$P$7+$J$7+$D$7,$AZ$7),0)","v":0},0,null,19,0,0,0,0,null,19,0,0,0,0,null,19,0,0,0,0]
[20,0,0,0,0,null,20,0,0,0,0,null,20,0,0,0,0,null,20,0,0,0,0,null,20,0,0,0,0,null,20,0,0,0,0,null,20,0,0,0,0,null,20,0,0,0,0,null,20,0,0,0,0,null,20,0,0,0,0,null,20,0,0,0,0,null,20,0,0,0,0]
[21,0,0,0,0,null,21,0,0,0,0,null,21,0,0,0,0,null,21,0,0,0,0,null,21,0,0,0,0,null,21,0,0,0,0,null,21,0,0,0,0,null,21,0,0,0,0,null,21,0,0,0,0,null,21,0,0,0,0,null,21,0,0,0,0,null,21,0,0,0,0]
[22,0,0,0,0,null,22,0,0,0,0,null,22,0,0,0,0,null,22,0,0,0,0,null,22,0,0,0,0,null,22,0,0,0,0,null,22,0,0,0,0,null,22,0,0,0,0,null,22,0,0,0,0,null,22,0,0,0,0,null,22,0,0,0,0,null,22,0,0,0,0]
[23,0,0,0,0,null,23,0,0,0,0,null,23,0,0,0,0,null,23,0,0,0,0,null,23,0,0,0,0,null,23,0,0,0,0,null,23,0,0,0,0,null,23,0,0,0,0,null,23,0,0,0,0,null,23,0,0,0,0,null,23,0,0,0,0,null,23,0,0,0,0]
[24,0,0,0,0,null,24,0,0,0,0,null,24,0,0,0,0,null,24,0,0,0,0,null,24,0,0,0,0,null,24,0,0,0,0,null,24,0,0,0,0,null,24,0,0,0,0,null,24,0,0,0,0,null,24,0,0,0,0,null,24,0,0,0,0,null,24,0,0,0,0]
[25,0,0,0,0,null,25,0,0,0,0,null,25,0,0,0,0,null,25,0,0,0,0,null,25,0,0,0,0,null,25,0,0,0,0,null,25,0,0,0,0,null,25,0,0,0,0,null,25,0,0,0,0,null,25,0,0,0,0,null,25,0,0,0,0,null,25,0,0,0,0]
[26,0,0,0,0,null,26,0,0,0,0,null,26,0,0,0,0,null,26,0,0,0,0,null,26,0,0,0,0,null,26,0,0,0,0,null,26,0,0,0,0,null,26,0,0,0,0,null,26,0,0,0,0,null,26,0,0,0,0,null,26,0,0,0,0,null,26,0,0,0,0]
[27,0,0,0,0,null,27,0,0,0,0,null,27,0,0,0,0,null,27,0,0,0,0,null,27,0,0,0,0,null,27,0,0,0,0,null,27,0,0,0,0,null,27,0,0,0,0,null,27,0,0,0,0,null,27,0,0,0,0,null,27,0,0,0,0,null,27,0,0,0,0]
[28,0,0,0,0,null,28,0,0,0,0,null,28,0,0,0,0,null,28,0,0,0,0,null,28,0,0,0,0,null,28,0,0,0,0,null,28,0,0,0,0,null,28,0,0,0,0,null,28,0,0,0,0,null,28,0,0,0,0,null,28,0,0,0,0,null,28,0,0,0,0]
[29,0,0,0,0,null,29,0,0,0,{"$f":"IF((H39+I39-J39)>0,H39+I39-J39,0)","v":0},null,29,0,0,0,0,null,29,0,0,0,0,null,29,0,0,0,0,null,29,0,0,0,0,null,29,0,0,0,0,null,29,0,0,0,0,null,29,0,0,0,0,null,29,0,0,0,0,null,29,0,0,0,0,null,29,0,0,0,0]
[30,0,0,{"$f":"IF((E39)>0,$D$7,0)","v":0},0,null,30,0,0,0,0,null,30,0,0,0,0,null,30,0,0,0,0,null,30,0,0,0,0,null,30,0,0,0,0,null,30,0,0,0,0,null,30,0,0,0,0,null,30,0,0,0,0,null,30,0,0,0,0,null,30,0,0,0,0,null,30,0,0,0,0]
[31,0,0,0,0,null,31,0,0,0,0,null,31,0,0,0,0,null,31,0,0,0,0,null,31,0,0,0,0,null,31,0,0,0,0,null,31,0,0,0,0,null,31,0,0,0,0,null,31,0,0,0,0,null,31,0,0,0,0,null,31,0,0,0,0,null,31,0,0,0,0]
[32,0,0,0,0,null,32,0,0,0,0,null,32,0,0,0,0,null,32,0,0,0,0,null,32,0,0,0,0,null,32,0,0,0,0,null,32,0,0,0,0,null,32,0,0,0,0,null,32,0,0,0,0,null,32,0,0,0,0,null,32,0,0,0,0,null,32,0,0,0,0]
[33,0,0,0,0,null,33,0,0,0,0,null,33,0,0,0,0,null,33,0,0,0,0,null,33,0,0,0,0,null,33,0,0,0,0,null,33,0,0,0,0,null,33,0,0,0,0,null,33,0,0,0,0,null,33,0,0,0,0,null,33,0,0,0,0,null,33,0,0,0,0]
[34,0,0,0,0,null,34,0,0,0,0,null,34,0,0,0,0,null,34,0,0,0,0,null,34,0,0,0,0,null,34,0,0,0,0,null,34,0,0,0,0,null,34,0,0,0,0,null,34,0,0,0,0,null,34,0,0,0,0,null,34,0,0,0,0,null,34,0,0,0,0]
[35,0,0,0,0,null,35,0,0,0,0,null,35,0,0,0,0,null,35,0,0,0,0,null,35,0,0,0,0,null,35,0,0,0,0,null,35,0,0,0,0,null,35,0,0,0,0,null,35,0,0,0,0,null,35,0,0,0,0,null,35,0,0,0,0,null,35,0,0,0,0]
[36,0,0,0,0,null,36,0,0,0,0,null,36,0,0,0,0,null,36,0,0,0,0,null,36,0,0,0,0,null,36,0,0,0,0,null,36,0,0,0,0,null,36,0,0,0,0,null,36,0,0,0,0,null,36,0,0,0,0,null,36,0,0,0,0,null,36,0,0,0,0]
[37,0,0,0,0,null,37,0,0,0,0,null,37,0,0,0,0,null,37,0,0,0,0,null,37,0,0,0,0,null,37,0,0,0,0,null,37,0,0,0,0,null,37,0,0,0,0,null,37,0,0,0,0,null,37,0,0,0,0,null,37,0,0,0,0,null,37,0,0,0,0]
[38,0,0,0,0,null,38,0,0,0,0,null,38,0,0,0,0,null,38,0,0,0,0,null,38,0,0,0,0,null,38,0,0,0,0,null,38,0,0,0,0,null,38,0,0,0,0,null,38,0,0,0,0,null,38,0,0,0,0,null,38,0,0,0,0,null,38,0,0,0,0]
[39,0,0,0,0,null,39,0,0,0,0,null,39,0,0,0,0,null,39,0,0,0,0,null,39,0,0,0,0,null,39,0,0,0,0,null,39,0,0,0,0,null,39,0,0,0,0,null,39,0,0,0,0,null,39,0,0,0,0,null,39,0,0,0,0,null,39,0,0,0,0]
[40,0,0,0,0,null,40,0,0,0,0,null,40,0,0,0,0,null,40,0,0,0,0,null,40,0,0,0,0,null,40,0,0,0,0,null,40,0,0,0,0,null,40,0,0,0,0,null,40,0,0,0,0,null,40,0,0,0,0,null,40,0,0,0,0,null,40,0,0,0,0]
[41,0,0,0,0,null,41,0,0,0,0,null,41,0,0,0,0,null,41,0,0,0,0,null,41,0,0,0,0,null,41,0,0,0,0,null,41,0,0,0,0,null,41,0,0,0,0,null,41,0,0,0,0,null,41,0,0,0,0,null,41,0,0,0,0,null,41,0,0,0,0]
[42,0,0,0,0,null,42,0,0,0,0,null,42,0,0,0,0,null,42,0,0,0,0,null,42,0,0,0,0,null,42,0,0,0,0,null,42,0,0,0,0,null,42,0,0,0,0,null,42,0,0,0,0,null,42,0,0,0,0,null,42,0,0,0,0,null,42,0,0,0,0]
[43,0,0,0,0,null,43,0,0,0,0,null,43,0,0,0,0,null,43,0,0,0,0,null,43,0,0,0,0,null,43,0,0,0,0,null,43,0,0,0,0,null,43,0,0,0,0,null,43,0,0,0,0,null,43,0,0,0,0,null,43,0,0,0,0,null,43,0,0,{"$f":"IF((BS52)>0,IF(BM52=0,$BR$7+$BL$7+$BF$7+$AZ$7+$AT$7+$AN$7+$AH$7+$AB$7+$V$7+$P$7+$J$7+$D$7,$BR$7),0)","v":0},0]
[44,0,0,0,0,null,44,0,0,0,0,null,44,0,0,0,0,null,44,0,0,0,0,null,44,0,0,0,0,null,44,0,0,0,0,null,44,0,0,0,0,null,44,0,0,0,0,null,44,0,0,0,0,null,44,0,0,0,0,null,44,0,0,0,0,null,44,0,0,0,0]
[45,0,0,0,0,null,45,0,0,0,0,null,45,0,0,0,0,null,45,0,0,0,0,null,45,0,0,0,0,null,45,0,0,0,0,null,45,0,0,0,0,null,45,0,0,0,0,null,45,0,0,0,0,null,45,0,0,0,0,null,45,0,0,0,0,null,45,0,0,0,0]
[46,0,0,0,0,null,46,0,0,0,0,null,46,0,0,0,0,null,46,0,0,0,0,null,46,0,0,0,0,null,46,0,0,0,0,null,46,0,0,0,0,null,46,0,0,0,0,null,46,0,0,0,0,null,46,0,0,0,0,null,46,0,0,0,0,null,46,0,0,0,0]
[47,0,0,0,0,null,47,0,0,0,0,null,47,0,0,0,0,null,47,0,0,0,0,null,47,0,0,0,0,null,47,0,0,0,0,null,47,0,0,0,0,null,47,0,0,0,0,null,47,0,0,0,0,null,47,0,0,0,0,null,47,0,0,0,0,null,47,0,0,0,0]
[48,0,0,0,0,null,48,0,0,0,0,null,48,0,0,0,0,null,48,0,0,0,0,null,48,0,0,0,0,null,48,0,0,0,0,null,48,0,0,0,0,null,48,0,0,0,0,null,48,0,0,0,0,null,48,0,0,0,0,null,48,0,0,0,0,null,48,0,0,0,0]
[49,0,0,0,0,null,49,0,0,0,0,null,49,0,0,0,0,null,49,0,0,0,0,null,49,0,0,0,0,null,49,0,0,0,0,null,49,0,0,0,0,null,49,0,0,0,0,null,49,0,0,0,0,null,49,0,0,0,0,null,49,0,0,0,0,null,49,0,0,0,0]
[50,0,0,0,0,null,50,0,0,0,0,null,50,0,0,0,0,null,50,0,0,0,0,null,50,0,0,0,0,null,50,0,0,0,0,null,50,0,0,0,0,null,50,0,0,0,0,null,50,0,0,0,0,null,50,0,0,0,0,null,50,0,0,0,0,null,50,0,0,0,0]
[51,0,0,0,0,null,51,0,0,0,0,null,51,0,0,0,0,null,51,0,0,0,0,null,51,0,0,0,0,null,51,0,0,0,0,null,51,0,0,0,0,null,51,0,0,0,0,null,51,0,0,0,0,null,51,0,0,0,0,null,51,0,0,0,0,null,51,0,0,0,0]
[52,0,0,0,0,null,52,0,0,0,0,null,52,0,0,0,0,null,52,0,0,0,0,null,52,0,0,0,0,null,52,0,0,0,0,null,52,0,0,0,0,null,52,0,0,0,0,null,52,0,0,0,0,null,52,0,0,0,0,null,52,0,0,0,0,null,52,0,0,0,0]
[53,0,0,0,0,null,53,0,0,0,0,null,53,0,0,0,0,null,53,0,0,0,0,null,53,0,0,0,0,null,53,0,0,0,0,null,53,0,0,0,0,null,53,0,0,0,0,null,53,0,0,0,0,null,53,0,0,0,0,null,53,0,0,0,0,null,53,0,0,0,0]
[54,0,0,0,0,null,54,0,0,0,0,null,54,0,0,0,0,null,54,0,0,0,0,null,54,0,0,0,0,null,54,0,0,0,0,null,54,0,0,0,0,null,54,0,0,0,0,null,54,0,0,0,0,null,54,0,0,0,0,null,54,0,0,0,0,null,54,0,0,0,0]
[55,0,0,0,0,null,55,0,0,0,0,null,55,0,0,0,0,null,55,0,0,0,0,null,55,0,0,0,0,null,55,0,0,0,0,null,55,0,0,0,0,null,55,0,0,0,0,null,55,0,0,0,0,null,55,0,0,0,0,null,55,0,0,0,0,null,55,0,0,0,0]
[56,0,0,0,0,null,56,0,0,0,0,null,56,0,0,0,0,null,56,0,0,0,0,null,56,0,0,0,0,null,56,0,0,0,0,null,56,0,0,0,0,null,56,0,0,0,0,null,56,0,0,0,0,null,56,0,0,0,0,null,56,0,0,0,0,null,56,0,0,0,0]
[57,0,0,0,0,null,57,0,0,0,0,null,57,0,0,0,0,null,57,0,0,0,0,null,57,0,0,0,0,null,57,0,0,0,0,null,57,0,0,0,0,null,57,0,0,0,0,null,57,0,0,0,0,null,57,0,0,0,0,null,57,0,0,0,0,null,57,0,0,0,0]
[58,0,0,0,0,null,58,0,0,0,0,null,58,0,0,0,0,null,58,0,0,0,0,null,58,0,0,0,0,null,58,0,0,0,0,null,58,0,0,0,0,null,58,0,0,0,0,null,58,0,0,0,0,null,58,0,0,0,0,null,58,0,0,0,0,null,58,0,0,0,0]
[59,0,0,0,0,null,59,0,0,0,0,null,59,0,0,0,0,null,59,0,0,0,0,null,59,0,0,0,0,null,59,0,0,0,0,null,59,0,0,0,0,null,59,0,0,0,0,null,59,0,0,0,0,null,59,0,0,0,0,null,59,0,0,0,0,null,59,0,0,0,0]
[60,0,0,0,0,null,60,0,0,0,0,null,60,0,0,0,0,null,60,0,0,0,0,null,60,0,0,0,0,null,60,0,0,0,0,null,60,0,0,0,0,null,60,0,0,0,0,null,60,0,0,0,0,null,60,0,0,0,0,null,60,0,0,0,0,null,60,0,0,0,0]
[61,0,0,0,0,null,61,0,0,0,0,null,61,0,0,0,0,null,61,0,0,0,0,null,61,0,0,0,0,null,61,0,0,0,0,null,61,0,0,0,0,null,61,0,0,0,0,null,61,0,0,0,0,null,61,0,0,0,0,null,61,0,0,0,0,null,61,0,0,0,0]
[62,0,0,0,0,null,62,0,0,0,0,null,62,0,0,0,0,null,62,0,0,0,0,null,62,0,0,0,0,null,62,0,0,0,0,null,62,0,0,0,0,null,62,0,0,0,0,null,62,0,0,0,0,null,62,0,0,0,0,null,62,0,0,0,0,null,62,0,0,0,0]
[63,0,0,0,0,null,63,0,0,0,0,null,63,0,0,0,0,null,63,0,0,0,0,null,63,0,0,0,0,null,63,0,0,0,0,null,63,0,0,0,0,null,63,0,0,0,0,null,63,0,0,0,0,null,63,0,0,0,0,null,63,0,0,0,0,null,63,0,0,0,0]
[64,0,0,0,0,null,64,0,0,0,0,null,64,0,0,0,0,null,64,0,0,0,0,null,64,0,0,0,0,null,64,0,0,0,0,null,64,0,0,0,0,null,64,0,0,0,0,null,64,0,0,0,0,null,64,0,0,0,0,null,64,0,0,0,0,null,64,0,0,0,0]
[65,0,0,0,0,null,65,0,0,0,0,null,65,0,0,0,0,null,65,0,0,0,0,null,65,0,0,0,0,null,65,0,0,0,0,null,65,0,0,0,0,null,65,0,0,0,0,null,65,0,0,0,0,null,65,0,0,0,0,null,65,0,0,0,0,null,65,0,0,0,0]
[66,0,0,0,{"$f":"IF((B76+C76-D76)>0,B76+C76-D76,0)","v":0},null,66,0,0,0,{"$f":"IF((H76+I76-J76)>0,H76+I76-J76,0)","v":0},null,66,0,0,0,{"$f":"IF((N76+O76-P76)>0,N76+O76-P76,0)","v":0},null,66,0,{"$f":"T76*$V$6","v":0},0,{"$f":"IF((T76+U76-V76)>0,T76+U76-V76,0)","v":0},null,66,0,{"$f":"Z76*$AB$6","v":0},0,{"$f":"IF((Z76+AA76-AB76)>0,Z76+AA76-AB76,0)","v":0},null,66,0,{"$f":"AF76*$AH$6","v":0},0,{"$f":"IF((AF76+AG76-AH76)>0,AF76+AG76-AH76,0)","v":0},null,66,0,{"$f":"AL76*$AN$6","v":0},0,0,null,66,0,{"$f":"AR76*$AT$6","v":0},0,{"$f":"IF((AR76+AS76-AT76)>0,AR76+AS76-AT76,0)","v":0},null,66,0,{"$f":"AX76*$AZ$6","v":0},0,{"$f":"IF((AX76+AY76-AZ76)>0,AX76+AY76-AZ76,0)","v":0},null,66,0,{"$f":"BD76*$BF$6","v":0},0,{"$f":"IF((BD76+BE76-BF76)>0,BD76+BE76-BF76,0)","v":0},null,66,0,{"$f":"BJ76*$BL$6","v":0},0,{"$f":"IF((BJ76+BK76-BL76)>0,BJ76+BK76-BL76,0)","v":0},null,66,0,{"$f":"BP76*$BR$6","v":0},0,{"$f":"IF((BP76+BQ76-BR76)>0,BP76+BQ76-BR76,0)","v":0}]
[67,{"$f":"E76","v":0},{"$f":"B77*$D$6","v":0},{"$f":"IF((E76)>0,$D$7,0)","v":0},0,null,67,{"$f":"K76","v":0},{"$f":"H77*$J$6","v":0},{"$f":"IF((K76)>0,IF(E76=0,$J$7+$D$7,$J$7),0)","v":0},0,null,67,{"$f":"Q76","v":0},{"$f":"N77*$P$6","v":0},{"$f":"IF((Q76)>0,IF(K76=0,$P$7+$J$7+$D$7,$P$7),0)","v":0},0,null,67,{"$f":"W76","v":0},0,{"$f":"IF((W76)>0,IF(Q76=0,$P$7+$J$7+$D$7+$V$7,$V$7),0)","v":0},0,null,67,{"$f":"AC76","v":0},0,{"$f":"IF((AC76)>0,IF(W76=0,$AB$7+$V$7+$P$7+$J$7+$D$7,$AB$7),0)","v":0},0,null,67,{"$f":"AI76","v":0},0,{"$f":"IF((AI76)>0,IF(AC76=0,$AH$7+$AB$7+$V$7+$P$7+$J$7+$D$7,$AH$7),0)","v":0},0,null,67,{"$f":"AO76","v":0},0,{"$f":"IF((AO76)>0,IF(AI76=0,$AN$7+$AH$7+$AB$7+$V$7+$P$7+$J$7+$D$7,$AN$7),0)","v":0},{"$f":"IF((AL77+AM77-AN77)>0,AL77+AM77-AN77,0)","v":0},null,67,{"$f":"AU76","v":0},0,{"$f":"IF((AU76)>0,IF(AO76=0,$AT$7+$AN$7+$AH$7+$AB$7+$V$7+$P$7+$J$7+$D$7,$AT$7),0)","v":0},0,null,67,{"$f":"BA76","v":0},0,{"$f":"IF((BA76)>0,IF(AU76=0,$AZ$7+$AT$7+$AN$7+$AH$7+$AB$7+$V$7+$P$7+$J$7+$D$7,$AZ$7),0)","v":0},0,null,67,{"$f":"BG76","v":0},0,{"$f":"IF((BG76)>0,IF(BA76=0,$BF$7+$AZ$7+$AT$7+$AN$7+$AH$7+$AB$7+$V$7+$P$7+$J$7+$D$7,$BF$7),0)","v":0},0,null,67,{"$f":"BM76","v":0},0,{"$f":"IF((BM76)>0,IF(BG76=0,$BL$7+$BF$7+$AZ$7+$AT$7+$AN$7+$AH$7+$AB$7+$V$7+$P$7+$J$7+$D$7,$BL$7),0)","v":0},0,null,67,{"$f":"BS76","v":0},0,{"$f":"IF((BS76)>0,IF(BM76=0,$BR$7+$BL$7+$BF$7+$AZ$7+$AT$7+$AN$7+$AH$7+$AB$7+$V$7+$P$7+$J$7+$D$7,$BR$7),0)","v":0},0]
[68,0,0,0,0,null,68,0,0,0,0,null,68,0,0,0,0,null,68,0,0,0,0,null,68,0,0,0,0,null,68,0,0,0,0,null,68,0,0,0,0,null,68,0,0,0,0,null,68,0,0,0,0,null,68,0,0,0,0,null,68,0,0,0,0,null,68,0,0,0,0]
[69,0,0,0,0,null,69,0,0,0,0,null,69,0,0,0,0,null,69,0,0,0,0,null,69,0,0,0,0,null,69,0,0,0,0,null,69,0,0,0,0,null,69,0,0,0,0,null,69,0,0,0,0,null,69,0,0,0,0,null,69,0,0,0,0,null,69,0,0,0,0]
[70,0,0,0,0,null,70,0,0,0,0,null,70,0,0,0,0,null,70,0,0,0,0,null,70,0,0,0,0,null,70,0,0,0,0,null,70,0,0,0,0,null,70,0,0,0,0,null,70,0,0,0,0,null,70,0,0,0,0,null,70,0,0,0,0,null,70,0,0,0,0]
[71,0,0,0,0,null,71,0,0,0,0,null,71,0,0,0,0,null,71,0,0,0,0,null,71,0,0,0,0,null,71,0,0,0,0,null,71,0,0,0,0,null,71,0,0,0,0,null,71,0,0,0,0,null,71,0,0,0,0,null,71,0,0,0,0,null,71,0,0,0,0]
[72,0,0,0,0,null,72,0,0,0,0,null,72,0,0,0,0,null,72,0,0,0,0,null,72,0,0,0,0,null,72,0,0,0,0,null,72,0,0,0,0,null,72,0,0,0,0,null,72,0,0,0,0,null,72,0,0,0,0,null,72,0,0,0,0,null,72,0,0,0,0]
[73,0,0,0,0,null,73,0,0,0,0,null,73,0,0,0,0,null,73,0,0,0,0,null,73,0,0,0,0,null,73,0,0,0,0,null,73,0,0,0,0,null,73,0,0,0,0,null,73,0,0,0,0,null,73,0,0,0,0,null,73,0,0,0,0,null,73,0,0,0,0]
[74,0,0,0,0,null,74,0,0,0,0,null,74,0,0,0,0,null,74,0,0,0,0,null,74,0,0,0,0,null,74,0,0,0,0,null,74,0,0,0,0,null,74,0,0,0,0,null,74,0,0,0,0,null,74,0,0,0,0,null,74,0,0,0,0,null,74,0,0,0,0]
[75,0,0,0,0,null,75,0,0,0,0,null,75,0,0,0,0,null,75,0,0,0,0,null,75,0,0,0,0,null,75,0,0,0,0,null,75,0,0,0,0,null,75,0,0,0,0,null,75,0,0,0,0,null,75,0,0,0,0,null,75,0,0,0,0,null,75,0,0,0,0]
[76,0,0,0,0,null,76,0,0,0,0,null,76,0,0,0,0,null,76,0,0,0,0,null,76,0,0,0,0,null,76,0,0,0,0,null,76,0,0,0,0,null,76,0,0,0,0,null,76,0,0,0,0,null,76,0,0,0,0,null,76,0,0,0,0,null,76,0,0,0,0]
[77,0,0,0,0,null,77,0,0,0,0,null,77,0,0,0,0,null,77,0,0,0,0,null,77,0,0,0,0,null,77,0,0,0,0,null,77,0,0,0,0,null,77,0,0,0,0,null,77,0,0,0,0,null,77,0,0,0,0,null,77,0,0,0,0,null,77,0,0,0,0]
[78,0,0,0,0,null,78,0,0,0,0,null,78,0,0,0,0,null,78,0,0,0,0,null,78,0,0,0,0,null,78,0,0,0,0,null,78,0,0,0,0,null,78,0,0,0,0,null,78,0,0,0,0,null,78,0,0,0,0,null,78,0,0,0,0,null,78,0,0,0,0]
[79,0,0,0,0,null,79,0,0,0,0,null,79,0,0,0,0,null,79,0,0,0,0,null,79,0,0,0,0,null,79,0,0,0,0,null,79,0,0,0,0,null,79,0,0,0,0,null,79,0,0,0,0,null,79,0,0,0,0,null,79,0,0,0,0,null,79,0,0,0,0]
[80,0,0,0,0,null,80,0,0,0,0,null,80,0,0,0,0,null,80,0,0,0,0,null,80,0,0,0,0,null,80,0,0,0,0,null,80,0,0,0,0,null,80,0,0,0,0,null,80,0,0,0,0,null,80,0,0,0,0,null,80,0,0,0,0,null,80,0,0,0,0]
[81,0,0,0,0,null,81,0,0,0,0,null,81,0,0,0,0,null,81,0,0,0,0,null,81,0,0,0,0,null,81,0,0,0,0,null,81,0,0,0,0,null,81,0,0,0,0,null,81,0,0,0,0,null,81,0,0,0,0,null,81,0,0,0,0,null,81,0,0,0,0]
[82,0,0,0,0,null,82,0,0,0,0,null,82,0,0,0,0,null,82,0,0,0,0,null,82,0,0,0,0,null,82,0,0,0,0,null,82,0,0,0,0,null,82,0,0,0,0,null,82,0,0,0,0,null,82,0,0,0,0,null,82,0,0,0,0,null,82,0,0,0,0]
[83,0,0,0,0,null,83,0,0,0,0,null,83,0,0,0,0,null,83,0,0,0,0,null,83,0,0,0,0,null,83,0,0,0,0,null,83,0,0,0,0,null,83,0,0,0,0,null,83,0,0,0,0,null,83,0,0,0,0,null,83,0,0,0,0,null,83,0,0,0,0]
[84,0,0,0,0,null,84,0,0,0,0,null,84,0,0,0,0,null,84,0,0,0,0,null,84,0,0,0,0,null,84,0,0,0,0,null,84,0,0,0,0,null,84,0,0,0,0,null,84,0,0,0,0,null,84,0,0,0,0,null,84,0,0,0,0,null,84,0,0,0,0]
[85,0,0,0,0,null,85,0,0,0,0,null,85,0,0,0,0,null,85,0,0,0,0,null,85,0,0,0,0,null,85,0,0,0,0,null,85,0,0,0,0,null,85,0,0,0,0,null,85,0,0,0,0,null,85,0,0,0,0,null,85,0,0,0,0,null,85,0,0,0,0]
[86,0,0,0,0,null,86,0,0,0,0,null,86,0,0,0,0,null,86,0,0,0,0,null,86,0,0,0,0,null,86,0,0,0,0,null,86,0,0,0,0,null,86,0,0,0,0,null,86,0,0,0,0,null,86,0,0,0,0,null,86,0,0,0,0,null,86,0,0,0,0]
[87,0,0,0,0,null,87,0,0,0,0,null,87,0,0,0,0,null,87,0,0,0,0,null,87,0,0,0,0,null,87,0,0,0,0,null,87,0,0,0,0,null,87,0,0,0,0,null,87,0,0,0,0,null,87,0,0,0,0,null,87,0,0,0,0,null,87,0,0,0,0]
[88,0,0,0,0,null,88,0,0,0,0,null,88,0,0,0,0,null,88,0,0,0,0,null,88,0,0,0,0,null,88,0,0,0,0,null,88,0,0,0,0,null,88,0,0,0,0,null,88,0,0,0,0,null,88,0,0,0,0,null,88,0,0,0,0,null,88,0,0,0,0]
[89,0,0,0,0,null,89,0,0,0,0,null,89,0,0,0,0,null,89,0,0,0,0,null,89,0,0,0,0,null,89,0,0,0,0,null,89,0,0,0,0,null,89,0,0,0,0,null,89,0,0,0,0,null,89,0,0,0,0,null,89,0,0,0,0,null,89,0,0,0,0]
[90,0,0,0,0,null,90,0,0,0,0,null,90,0,0,0,0,null,90,0,0,0,0,null,90,0,0,0,0,null,90,0,0,0,0,null,90,0,0,0,0,null,90,0,0,0,0,null,90,0,0,0,0,null,90,0,0,0,0,null,90,0,0,0,0,null,90,0,0,0,0]
[91,0,0,0,0,null,91,0,0,0,0,null,91,0,0,0,0,null,91,0,0,0,0,null,91,0,0,0,0,null,91,0,0,0,0,null,91,0,0,0,0,null,91,0,0,0,0,null,91,0,0,0,0,null,91,0,0,0,0,null,91,0,0,0,0,null,91,0,0,0,0]
[92,0,0,0,0,null,92,0,0,0,0,null,92,0,0,0,0,null,92,0,0,0,0,null,92,0,0,0,0,null,92,0,0,0,0,null,92,0,0,0,0,null,92,0,0,0,0,null,92,0,0,0,0,null,92,0,0,0,0,null,92,0,0,0,0,null,92,0,0,0,0]
[93,0,0,0,0,null,93,0,0,0,0,null,93,0,0,0,0,null,93,0,0,0,0,null,93,0,0,0,0,null,93,0,0,0,0,null,93,0,0,0,0,null,93,0,0,0,0,null,93,0,0,0,0,null,93,0,0,0,0,null,93,0,0,0,0,null,93,0,0,0,0]
[94,0,0,0,0,null,94,0,0,0,0,null,94,0,0,0,0,null,94,0,0,0,0,null,94,0,0,0,0,null,94,0,0,0,0,null,94,0,0,0,0,null,94,0,0,0,0,null,94,0,0,0,0,null,94,0,0,0,0,null,94,0,0,0,0,null,94,0,0,0,0]
[95,0,0,0,0,null,95,0,0,0,0,null,95,0,0,0,0,null,95,0,0,0,0,null,95,0,0,0,0,null,95,0,0,0,0,null,95,0,0,0,0,null,95,0,0,0,0,null,95,0,0,0,0,null,95,0,0,0,0,null,95,0,0,0,0,null,95,0,0,0,0]
[96,0,0,0,0,null,96,0,0,0,0,null,96,0,0,0,0,null,96,0,0,0,0,null,96,0,0,0,0,null,96,0,0,0,0,null,96,0,0,0,0,null,96,0,0,0,0,null,96,0,0,0,0,null,96,0,0,0,0,null,96,0,0,0,0,null,96,0,0,0,0]
[97,0,0,0,0,null,97,0,0,0,0,null,97,0,0,0,0,null,97,0,0,0,0,null,97,0,0,0,0,null,97,0,0,0,0,null,97,0,0,0,0,null,97,0,0,0,0,null,97,0,0,0,0,null,97,0,0,0,0,null,97,0,0,0,0,null,97,0,0,0,0]
[98,0,0,0,0,null,98,0,0,0,0,null,98,0,0,0,0,null,98,0,0,0,0,null,98,0,0,0,0,null,98,0,0,0,0,null,98,0,0,0,0,null,98,0,0,0,0,null,98,0,0,0,0,null,98,0,0,0,0,null,98,0,0,0,0,null,98,0,0,0,0]
[99,0,0,0,0,null,99,0,0,0,0,null,99,0,0,0,0,null,99,0,0,0,0,null,99,0,0,0,0,null,99,0,0,0,0,null,99,0,0,0,0,null,99,0,0,0,0,null,99,0,0,0,0,null,99,0,0,0,0,null,99,0,0,0,0,null,99,0,0,0,0]
[100,0,0,0,0,null,100,0,0,0,0,null,100,0,0,0,0,null,100,0,0,0,0,null,100,0,0,0,0,null,100,0,0,0,0,null,100,0,0,0,0,null,100,0,0,0,0,null,100,0,0,0,0,null,100,0,0,0,0,null,100,0,0,0,0,null,100,0,0,0,0]
[101,0,0,0,0,null,101,0,0,0,0,null,101,0,0,0,0,null,101,0,0,0,0,null,101,0,0,0,0,null,101,0,0,0,0,null,101,0,0,0,0,null,101,0,0,0,0,null,101,0,0,0,0,null,101,0,0,0,0,null,101,0,0,0,0,null,101,0,0,0,0]
[102,0,0,0,0,null,102,0,0,0,0,null,102,0,0,0,0,null,102,0,0,0,0,null,102,0,0,0,0,null,102,0,0,0,0,null,102,0,0,0,0,null,102,0,0,0,0,null,102,0,0,0,0,null,102,0,0,0,0,null,102,0,0,0,0,null,102,0,0,0,0]
[103,0,0,0,0,null,103,0,0,0,0,null,103,0,0,0,0,null,103,0,0,0,0,null,103,0,0,0,0,null,103,0,0,0,0,null,103,0,0,0,0,null,103,0,0,0,0,null,103,0,0,0,0,null,103,0,0,0,0,null,103,0,0,0,0,null,103,0,0,0,0]
[104,0,0,0,0,null,104,0,0,0,0,null,104,0,0,0,0,null,104,0,0,0,0,null,104,0,0,0,0,null,104,0,0,0,0,null,104,0,0,0,0,null,104,0,0,0,0,null,104,0,0,0,0,null,104,0,0,0,0,null,104,0,0,0,0,null,104,0,0,0,0]
[105,0,0,0,0,null,105,0,0,0,0,null,105,0,0,0,0,null,105,0,0,0,0,null,105,0,0,0,0,null,105,0,0,0,0,null,105,0,0,0,0,null,105,0,0,0,0,null,105,0,0,0,0,null,105,0,0,0,0,null,105,0,0,0,0,null,105,0,0,0,0]
[106,0,0,0,0,null,106,0,0,0,0,null,106,0,0,0,0,null,106,0,0,0,0,null,106,0,0,0,0,null,106,0,0,0,0,null,106,0,0,0,0,null,106,0,0,0,0,null,106,0,0,0,0,null,106,0,0,0,0,null,106,0,0,0,0,null,106,0,0,0,0]
[107,0,0,0,0,null,107,0,0,0,0,null,107,0,0,0,0,null,107,0,0,0,0,null,107,0,0,0,0,null,107,0,0,0,0,null,107,0,0,0,0,null,107,0,0,0,0,null,107,0,0,0,0,null,107,0,0,0,0,null,107,0,0,0,0,null,107,0,0,0,0]
[108,0,0,0,0,null,108,0,0,0,0,null,108,0,0,0,0,null,108,0,0,0,0,null,108,0,0,0,0,null,108,0,0,0,0,null,108,0,0,0,0,null,108,0,0,0,0,null,108,0,0,0,0,null,108,0,0,0,0,null,108,0,0,0,0,null,108,0,0,0,0]
[109,0,0,0,0,null,109,0,0,0,0,null,109,0,0,0,0,null,109,0,0,0,0,null,109,0,0,0,0,null,109,0,0,0,0,null,109,0,0,0,0,null,109,0,0,0,0,null,109,0,0,0,0,null,109,0,0,0,0,null,109,0,0,0,0,null,109,0,0,0,0]
[110,0,0,0,0,null,110,0,0,0,0,null,110,0,0,0,0,null,110,0,0,0,0,null,110,0,0,0,0,null,110,0,0,0,0,null,110,0,0,0,0,null,110,0,0,0,0,null,110,0,0,0,0,null,110,0,0,0,0,null,110,0,0,0,0,null,110,0,0,0,0]
[111,0,0,0,0,null,111,0,0,0,0,null,111,0,0,0,0,null,111,0,0,0,0,null,111,0,0,0,0,null,111,0,0,0,0,null,111,0,0,0,0,null,111,0,0,0,0,null,111,0,0,0,0,null,111,0,0,0,0,null,111,0,0,0,0,null,111,0,0,0,0]
[112,0,0,0,0,null,112,0,0,0,0,null,112,0,0,0,0,null,112,0,0,0,0,null,112,0,0,0,0,null,112,0,0,0,0,null,112,0,0,0,0,null,112,0,0,0,0,null,112,0,0,0,0,null,112,0,0,0,0,null,112,0,0,0,0,null,112,0,0,0,0]
[113,0,0,0,0,null,113,0,0,0,0,null,113,0,0,0,0,null,113,0,0,0,0,null,113,0,0,0,0,null,113,0,0,0,0,null,113,0,0,0,0,null,113,0,0,0,0,null,113,0,0,0,0,null,113,0,0,0,0,null,113,0,0,0,0,null,113,0,0,0,0]
[114,0,0,0,0,null,114,0,0,0,0,null,114,0,0,0,0,null,114,0,0,0,0,null,114,0,0,0,0,null,114,0,0,0,0,null,114,0,0,0,0,null,114,0,0,0,0,null,114,0,0,0,0,null,114,0,0,0,0,null,114,0,0,0,0,null,114,0,0,0,0]
[115,0,0,0,0,null,115,0,0,0,0,null,115,0,0,0,0,null,115,0,0,0,0,null,115,0,0,0,0,null,115,0,0,0,0,null,115,0,0,0,0,null,115,0,0,0,0,null,115,0,0,0,0,null,115,0,0,0,0,null,115,0,0,0,0,null,115,0,0,0,0]
[116,0,0,0,0,null,116,0,0,0,0,null,116,0,0,0,0,null,116,0,0,0,0,null,116,0,0,0,0,null,116,0,0,0,0,null,116,0,0,0,0,null,116,0,0,0,0,null,116,0,0,0,0,null,116,0,0,0,0,null,116,0,0,0,0,null,116,0,0,0,0]
[117,0,0,0,0,null,117,0,0,0,0,null,117,0,0,0,0,null,117,0,0,0,0,null,117,0,0,0,0,null,117,0,0,0,0,null,117,0,0,0,0,null,117,0,0,0,0,null,117,0,0,0,0,null,117,0,0,0,0,null,117,0,0,0,0,null,117,0,0,0,0]
[118,0,0,0,0,null,118,0,0,0,0,null,118,0,0,0,0,null,118,0,0,0,0,null,118,0,0,0,0,null,118,0,0,0,0,null,118,0,0,0,0,null,118,0,0,0,0,null,118,0,0,0,0,null,118,0,0,0,0,null,118,0,0,0,0,null,118,0,0,0,0]
[119,0,0,0,0,null,119,0,0,0,0,null,119,0,0,0,0,null,119,0,0,0,0,null,119,0,0,0,0,null,119,0,0,0,0,null,119,0,0,0,0,null,119,0,0,0,0,null,119,0,0,0,0,null,119,0,0,0,0,null,119,0,0,0,0,null,119,0,0,0,0]
[120,0,0,0,0,null,120,0,0,0,0,null,120,0,0,0,0,null,120,0,0,0,0,null,120,0,0,0,0,null,120,0,0,0,0,null,120,0,0,0,0,null,120,0,0,0,0,null,120,0,0,0,0,null,120,0,0,0,0,null,120,0,0,0,0,null,120,0,0,0,0]
[121,0,0,0,0,null,121,0,0,0,0,null,121,0,0,0,0,null,121,0,0,0,0,null,121,0,0,0,0,null,121,0,0,0,0,null,121,0,0,0,0,null,121,0,0,0,0,null,121,0,0,0,0,null,121,0,0,0,0,null,121,0,0,0,0,null,121,0,0,0,0]
[122,0,0,0,0,null,122,0,0,0,0,null,122,0,0,0,0,null,122,0,0,0,0,null,122,0,0,0,0,null,122,0,0,0,0,null,122,0,0,0,0,null,122,0,0,0,0,null,122,0,0,0,0,null,122,0,0,0,0,null,122,0,0,0,0,null,122,0,0,0,0]
[123,0,0,0,0,null,123,0,0,0,0,null,123,0,0,0,0,null,123,0,0,0,0,null,123,0,0,0,0,null,123,0,0,0,0,null,123,0,0,0,0,null,123,0,0,0,0,null,123,0,0,0,0,null,123,0,0,0,0,null,123,0,0,0,0,null,123,0,0,0,0]
[124,0,0,0,0,null,124,0,0,0,0,null,124,0,0,0,0,null,124,0,0,0,0,null,124,0,0,0,0,null,124,0,0,0,0,null,124,0,0,0,0,null,124,0,0,0,0,null,124,0,0,0,0,null,124,0,0,0,0,null,124,0,0,0,0,null,124,0,0,0,0]
[125,0,0,0,0,null,125,0,0,0,0,null,125,0,0,0,0,null,125,0,0,0,0,null,125,0,0,0,0,null,125,0,0,0,0,null,125,0,0,0,0,null,125,0,0,0,0,null,125,0,0,0,0,null,125,0,0,0,0,null,125,0,0,0,0,null,125,0,0,0,0]
[126,0,0,0,0,null,126,0,0,0,0,null,126,0,0,0,0,null,126,0,0,0,0,null,126,0,0,0,0,null,126,0,0,0,0,null,126,0,0,0,0,null,126,0,0,0,0,null,126,0,0,0,0,null,126,0,0,0,0,null,126,0,0,0,0,null,126,0,0,0,0]
[127,0,0,0,0,null,127,0,0,0,0,null,127,0,0,0,0,null,127,0,0,0,0,null,127,0,0,0,0,null,127,0,0,0,0,null,127,0,0,0,0,null,127,0,0,0,0,null,127,0,0,0,0,null,127,0,0,0,0,null,127,0,0,0,0,null,127,0,0,0,0]
[128,0,0,0,0,null,128,0,0,0,0,null,128,0,0,0,0,null,128,0,0,0,0,null,128,0,0,0,0,null,128,0,0,0,0,null,128,0,0,0,0,null,128,0,0,0,0,null,128,0,0,0,0,null,128,0,0,0,0,null,128,0,0,0,0,null,128,0,0,0,0]
[129,0,0,0,0,null,129,0,0,0,0,null,129,0,0,0,0,null,129,0,0,0,0,null,129,0,0,0,0,null,129,0,0,0,0,null,129,0,0,0,0,null,129,0,0,0,0,null,129,0,0,0,0,null,129,0,0,0,0,null,129,0,0,0,0,null,129,0,0,0,0]
[130,0,0,0,{"$f":"IF((B140+C140-D140)>0,B140+C140-D140,0)","v":0},null,130,0,0,0,{"$f":"IF((H140+I140-J140)>0,H140+I140-J140,0)","v":0},null,130,0,0,0,{"$f":"IF((N140+O140-P140)>0,N140+O140-P140,0)","v":0},null,130,0,{"$f":"T140*$V$6","v":0},0,{"$f":"IF((T140+U140-V140)>0,T140+U140-V140,0)","v":0},null,130,0,{"$f":"Z140*$AB$6","v":0},0,{"$f":"IF((Z140+AA140-AB140)>0,Z140+AA140-AB140,0)","v":0},null,130,0,{"$f":"AF140*$AH$6","v":0},0,{"$f":"IF((AF140+AG140-AH140)>0,AF140+AG140-AH140,0)","v":0},null,130,0,{"$f":"AL140*$AN$6","v":0},0,0,null,130,0,{"$f":"AR140*$AT$6","v":0},0,{"$f":"IF((AR140+AS140-AT140)>0,AR140+AS140-AT140,0)","v":0},null,130,0,{"$f":"AX140*$AZ$6","v":0},0,{"$f":"IF((AX140+AY140-AZ140)>0,AX140+AY140-AZ140,0)","v":0},null,130,0,{"$f":"BD140*$BF$6","v":0},0,{"$f":"IF((BD140+BE140-BF140)>0,BD140+BE140-BF140,0)","v":0},null,130,0,{"$f":"BJ140*$BL$6","v":0},0,{"$f":"IF((BJ140+BK140-BL140)>0,BJ140+BK140-BL140,0)","v":0},null,130,0,{"$f":"BP140*$BR$6","v":0},0,{"$f":"IF((BP140+BQ140-BR140)>0,BP140+BQ140-BR140,0)","v":0}]
[131,{"$f":"E140","v":0},{"$f":"B141*$D$6","v":0},{"$f":"IF((E140)>0,$D$7,0)","v":0},0,null,131,{"$f":"K140","v":0},{"$f":"H141*$J$6","v":0},{"$f":"IF((K140)>0,IF(E140=0,$J$7+$D$7,$J$7),0)","v":0},0,null,131,{"$f":"Q140","v":0},{"$f":"N141*$P$6","v":0},{"$f":"IF((Q140)>0,IF(K140=0,$P$7+$J$7+$D$7,$P$7),0)","v":0},0,null,131,{"$f":"W140","v":0},0,{"$f":"IF((W140)>0,IF(Q140=0,$P$7+$J$7+$D$7+$V$7,$V$7),0)","v":0},0,null,131,{"$f":"AC140","v":0},0,{"$f":"IF((AC140)>0,IF(W140=0,$AB$7+$V$7+$P$7+$J$7+$D$7,$AB$7),0)","v":0},0,null,131,{"$f":"AI140","v":0},0,{"$f":"IF((AI140)>0,IF(AC140=0,$AH$7+$AB$7+$V$7+$P$7+$J$7+$D$7,$AH$7),0)","v":0},0,null,131,{"$f":"AO140","v":0},0,{"$f":"IF((AO140)>0,IF(AI140=0,$AN$7+$AH$7+$AB$7+$V$7+$P$7+$J$7+$D$7,$AN$7),0)","v":0},{"$f":"IF((AL141+AM141-AN141)>0,AL141+AM141-AN141,0)","v":0},null,131,{"$f":"AU140","v":0},0,{"$f":"IF((AU140)>0,IF(AO140=0,$AT$7+$AN$7+$AH$7+$AB$7+$V$7+$P$7+$J$7+$D$7,$AT$7),0)","v":0},0,null,131,{"$f":"BA140","v":0},0,{"$f":"IF((BA140)>0,IF(AU140=0,$AZ$7+$AT$7+$AN$7+$AH$7+$AB$7+$V$7+$P$7+$J$7+$D$7,$AZ$7),0)","v":0},0,null,131,{"$f":"BG140","v":0},0,{"$f":"IF((BG140)>0,IF(BA140=0,$BF$7+$AZ$7+$AT$7+$AN$7+$AH$7+$AB$7+$V$7+$P$7+$J$7+$D$7,$BF$7),0)","v":0},0,null,131,{"$f":"BM140","v":0},0,{"$f":"IF((BM140)>0,IF(BG140=0,$BL$7+$BF$7+$AZ$7+$AT$7+$AN$7+$AH$7+$AB$7+$V$7+$P$7+$J$7+$D$7,$BL$7),0)","v":0},0,null,131,{"$f":"BS140","v":0},0,{"$f":"IF((BS140)>0,IF(BM140=0,$BR$7+$BL$7+$BF$7+$AZ$7+$AT$7+$AN$7+$AH$7+$AB$7+$V$7+$P$7+$J$7+$D$7,$BR$7),0)","v":0},0]
[132,0,0,0,0,null,132,0,0,0,0,null,132,0,0,0,0,null,132,0,0,0,0,null,132,0,0,0,0,null,132,0,0,0,0,null,132,0,0,0,0,null,132,0,0,0,0,null,132,0,0,0,0,null,132,0,0,0,0,null,132,0,0,0,0,null,132,0,0,0,0]
[133,0,0,0,0,null,133,0,0,0,0,null,133,0,0,0,0,null,133,0,0,0,0,null,133,0,0,0,0,null,133,0,0,0,0,null,133,0,0,0,0,null,133,0,0,0,0,null,133,0,0,0,0,null,133,0,0,0,0,null,133,0,0,0,0,null,133,0,0,0,0]
[134,0,0,0,0,null,134,0,0,0,0,null,134,0,0,0,0,null,134,0,0,0,0,null,134,0,0,0,0,null,134,0,0,0,0,null,134,0,0,0,0,null,134,0,0,0,0,null,134,0,0,0,0,null,134,0,0,0,0,null,134,0,0,0,0,null,134,0,0,0,0]
[135,0,0,0,0,null,135,0,0,0,0,null,135,0,0,0,0,null,135,0,0,0,0,null,135,0,0,0,0,null,135,0,0,0,0,null,135,0,0,0,0,null,135,0,0,0,0,null,135,0,0,0,0,null,135,0,0,0,0,null,135,0,0,0,0,null,135,0,0,0,0]
[136,0,0,0,0,null,136,0,0,0,0,null,136,0,0,0,0,null,136,0,0,0,0,null,136,0,0,0,0,null,136,0,0,0,0,null,136,0,0,0,0,null,136,0,0,0,0,null,136,0,0,0,0,null,136,0,0,0,0,null,136,0,0,0,0,null,136,0,0,0,0]
[137,0,0,0,0,null,137,0,0,0,0,null,137,0,0,0,0,null,137,0,0,0,0,null,137,0,0,0,0,null,137,0,0,0,0,null,137,0,0,0,0,null,137,0,0,0,0,null,137,0,0,0,0,null,137,0,0,0,0,null,137,0,0,0,0,null,137,0,0,0,0]
[138,0,0,0,0,null,138,0,0,0,0,null,138,0,0,0,0,null,138,0,0,0,0,null,138,0,0,0,0,null,138,0,0,0,0,null,138,0,0,0,0,null,138,0,0,0,0,null,138,0,0,0,0,null,138,0,0,0,0,null,138,0,0,0,0,null,138,0,0,0,0]
[139,0,0,0,0,null,139,0,0,0,0,null,139,0,0,0,0,null,139,0,0,0,0,null,139,0,0,0,0,null,139,0,0,0,0,null,139,0,0,0,0,null,139,0,0,0,0,null,139,0,0,0,0,null,139,0,0,0,0,null,139,0,0,0,0,null,139,0,0,0,0]
[140,0,0,0,0,null,140,0,0,0,0,null,140,0,0,0,0,null,140,0,0,0,0,null,140,0,0,0,0,null,140,0,0,0,0,null,140,0,0,0,0,null,140,0,0,0,0,null,140,0,0,0,0,null,140,0,0,0,0,null,140,0,0,0,0,null,140,0,0,0,0]
[141,0,0,0,0,null,141,0,0,0,0,null,141,0,0,0,0,null,141,0,0,0,0,null,141,0,0,0,0,null,141,0,0,0,0,null,141,0,0,0,0,null,141,0,0,0,0,null,141,0,0,0,0,null,141,0,0,0,0,null,141,0,0,0,0,null,141,0,0,0,0]
[142,0,0,0,0,null,142,0,0,0,0,null,142,0,0,0,0,null,142,0,0,0,0,null,142,0,0,0,0,null,142,0,0,0,0,null,142,0,0,0,0,null,142,0,0,0,0,null,142,0,0,0,0,null,142,0,0,0,0,null,142,0,0,0,0,null,142,0,0,0,0]
[143,0,0,0,0,null,143,0,0,0,0,null,143,0,0,0,0,null,143,0,0,0,0,null,143,0,0,0,0,null,143,0,0,0,0,null,143,0,0,0,0,null,143,0,0,0,0,null,143,0,0,0,0,null,143,0,0,0,0,null,143,0,0,0,0,null,143,0,0,0,0]
[144,0,0,0,0,null,144,0,0,0,0,null,144,0,0,0,0,null,144,0,0,0,0,null,144,0,0,0,0,null,144,0,0,0,0,null,144,0,0,0,0,null,144,0,0,0,0,null,144,0,0,0,0,null,144,0,0,0,0,null,144,0,0,0,0,null,144,0,0,0,0]
[145,0,0,0,0,null,145,0,0,0,0,null,145,0,0,0,0,null,145,0,0,0,0,null,145,0,0,0,0,null,145,0,0,0,0,null,145,0,0,0,0,null,145,0,0,0,0,null,145,0,0,0,0,null,145,0,0,0,0,null,145,0,0,0,0,null,145,0,0,0,0]
[146,0,0,0,0,null,146,0,0,0,0,null,146,0,0,0,0,null,146,0,0,0,0,null,146,0,0,0,0,null,146,0,0,0,0,null,146,0,0,0,0,null,146,0,0,0,0,null,146,0,0,0,0,null,146,0,0,0,0,null,146,0,0,0,0,null,146,0,0,0,0]
[147,0,0,0,0,null,147,0,0,0,0,null,147,0,0,0,0,null,147,0,0,0,0,null,147,0,0,0,0,null,147,0,0,0,0,null,147,0,0,0,0,null,147,0,0,0,0,null,147,0,0,0,0,null,147,0,0,0,0,null,147,0,0,0,0,null,147,0,0,0,0]
[148,0,0,0,0,null,148,0,0,0,0,null,148,0,0,0,0,null,148,0,0,0,0,null,148,0,0,0,0,null,148,0,0,0,0,null,148,0,0,0,0,null,148,0,0,0,0,null,148,0,0,0,0,null,148,0,0,0,0,null,148,0,0,0,0,null,148,0,0,0,0]
[149,0,0,0,0,null,149,0,0,0,0,null,149,0,0,0,0,null,149,0,0,0,0,null,149,0,0,0,0,null,149,0,0,0,0,null,149,0,0,0,0,null,149,0,0,0,0,null,149,0,0,0,0,null,149,0,0,0,0,null,149,0,0,0,0,null,149,0,0,0,0]
[150,0,0,0,0,null,150,0,0,0,0,null,150,0,0,0,0,null,150,0,0,0,0,null,150,0,0,0,0,null,150,0,0,0,0,null,150,0,0,0,0,null,150,0,0,0,0,null,150,0,0,0,0,null,150,0,0,0,0,null,150,0,0,0,0,null,150,0,0,0,0]
[151,0,0,0,0,null,151,0,0,0,0,null,151,0,0,0,0,null,151,0,0,0,0,null,151,0,0,0,0,null,151,0,0,0,0,null,151,0,0,0,0,null,151,0,0,0,0,null,151,0,0,0,0,null,151,0,0,0,0,null,151,0,0,0,0,null,151,0,0,0,0]
[152,0,0,0,0,null,152,0,0,0,0,null,152,0,0,0,0,null,152,0,0,0,0,null,152,0,0,0,0,null,152,0,0,0,0,null,152,0,0,0,0,null,152,0,0,0,0,null,152,0,0,0,0,null,152,0,0,0,0,null,152,0,0,0,0,null,152,0,0,0,0]
[153,0,0,0,0,null,153,0,0,0,0,null,153,0,0,0,0,null,153,0,0,0,0,null,153,0,0,0,0,null,153,0,0,0,0,null,153,0,0,0,0,null,153,0,0,0,0,null,153,0,0,0,0,null,153,0,0,0,0,null,153,0,0,0,0,null,153,0,0,0,0]
[154,0,0,0,0,null,154,0,0,0,0,null,154,0,0,0,0,null,154,0,0,0,0,null,154,0,0,0,0,null,154,0,0,0,0,null,154,0,0,0,0,null,154,0,0,0,0,null,154,0,0,0,0,null,154,0,0,0,0,null,154,0,0,0,0,null,154,0,0,0,0]
[155,0,0,0,0,null,155,0,0,0,0,null,155,0,0,0,0,null,155,0,0,0,0,null,155,0,0,0,0,null,155,0,0,0,0,null,155,0,0,0,0,null,155,0,0,0,0,null,155,0,0,0,0,null,155,0,0,0,0,null,155,0,0,0,0,null,155,0,0,0,0]
[156,0,0,0,0,null,156,0,0,0,0,null,156,0,0,0,0,null,156,0,0,0,0,null,156,0,0,0,0,null,156,0,0,0,0,null,156,0,0,0,0,null,156,0,0,0,0,null,156,0,0,0,0,null,156,0,0,0,0,null,156,0,0,0,0,null,156,0,0,0,0]
[157,0,0,0,0,null,157,0,0,0,0,null,157,0,0,0,0,null,157,0,0,0,0,null,157,0,0,0,0,null,157,0,0,0,0,null,157,0,0,0,0,null,157,0,0,0,0,null,157,0,0,0,0,null,157,0,0,0,0,null,157,0,0,0,0,null,157,0,0,0,0]
[158,0,0,0,0,null,158,0,0,0,0,null,158,0,0,0,0,null,158,0,0,0,0,null,158,0,0,0,0,null,158,0,0,0,0,null,158,0,0,0,0,null,158,0,0,0,0,null,158,0,0,0,0,null,158,0,0,0,0,null,158,0,0,0,0,null,158,0,0,0,0]
[159,0,0,0,0,null,159,0,0,0,0,null,159,0,0,0,0,null,159,0,0,0,0,null,159,0,0,0,0,null,159,0,0,0,0,null,159,0,0,0,0,null,159,0,0,0,0,null,159,0,0,0,0,null,159,0,0,0,0,null,159,0,0,0,0,null,159,0,0,0,0]
[160,0,0,0,0,null,160,0,0,0,0,null,160,0,0,0,0,null,160,0,0,0,0,null,160,0,0,0,0,null,160,0,0,0,0,null,160,0,0,0,0,null,160,0,0,0,0,null,160,0,0,0,0,null,160,0,0,0,0,null,160,0,0,0,0,null,160,0,0,0,0]
[161,0,0,0,0,null,161,0,0,0,0,null,161,0,0,0,0,null,161,0,0,0,0,null,161,0,0,0,0,null,161,0,0,0,0,null,161,0,0,0,0,null,161,0,0,0,0,null,161,0,0,0,0,null,161,0,0,0,0,null,161,0,0,0,0,null,161,0,0,0,0]
[162,0,0,0,0,null,162,0,0,0,0,null,162,0,0,0,0,null,162,0,0,0,0,null,162,0,0,0,0,null,162,0,0,0,0,null,162,0,0,0,0,null,162,0,0,0,0,null,162,0,0,0,0,null,162,0,0,0,0,null,162,0,0,0,0,null,162,0,0,0,0]
[163,0,0,0,0,null,163,0,0,0,0,null,163,0,0,0,0,null,163,0,0,0,0,null,163,0,0,0,0,null,163,0,0,0,0,null,163,0,0,0,0,null,163,0,0,0,0,null,163,0,0,0,0,null,163,0,0,0,0,null,163,0,0,0,0,null,163,0,0,0,0]
[164,0,0,0,0,null,164,0,0,0,0,null,164,0,0,0,0,null,164,0,0,0,0,null,164,0,0,0,0,null,164,0,0,0,0,null,164,0,0,0,0,null,164,0,0,0,0,null,164,0,0,0,0,null,164,0,0,0,0,null,164,0,0,0,0,null,164,0,0,0,0]
[165,0,0,0,0,null,165,0,0,0,0,null,165,0,0,0,0,null,165,0,0,0,0,null,165,0,0,0,0,null,165,0,0,0,0,null,165,0,0,0,0,null,165,0,0,0,0,null,165,0,0,0,0,null,165,0,0,0,0,null,165,0,0,0,0,null,165,0,0,0,0]
[166,0,0,0,0,null,166,0,0,0,0,null,166,0,0,0,0,null,166,0,0,0,0,null,166,0,0,0,0,null,166,0,0,0,0,null,166,0,0,0,0,null,166,0,0,0,0,null,166,0,0,0,0,null,166,0,0,0,0,null,166,0,0,0,0,null,166,0,0,0,0]
[167,0,0,0,0,null,167,0,0,0,0,null,167,0,0,0,0,null,167,0,0,0,0,null,167,0,0,0,0,null,167,0,0,0,0,null,167,0,0,0,0,null,167,0,0,0,0,null,167,0,0,0,0,null,167,0,0,0,0,null,167,0,0,0,0,null,167,0,0,0,0]
[168,0,0,0,0,null,168,0,0,0,0,null,168,0,0,0,0,null,168,0,0,0,0,null,168,0,0,0,0,null,168,0,0,0,0,null,168,0,0,0,0,null,168,0,0,0,0,null,168,0,0,0,0,null,168,0,0,0,0,null,168,0,0,0,0,null,168,0,0,0,0]
[169,0,0,0,0,null,169,0,0,0,0,null,169,0,0,0,0,null,169,0,0,0,0,null,169,0,0,0,0,null,169,0,0,0,0,null,169,0,0,0,0,null,169,0,0,0,0,null,169,0,0,0,0,null,169,0,0,0,0,null,169,0,0,0,0,null,169,0,0,0,0]
[170,0,0,0,0,null,170,0,0,0,0,null,170,0,0,0,0,null,170,0,0,0,0,null,170,0,0,0,0,null,170,0,0,0,0,null,170,0,0,0,0,null,170,0,0,0,0,null,170,0,0,0,0,null,170,0,0,0,0,null,170,0,0,0,0,null,170,0,0,0,0]
[171,0,0,0,0,null,171,0,0,0,0,null,171,0,0,0,0,null,171,0,0,0,0,null,171,0,0,0,0,null,171,0,0,0,0,null,171,0,0,0,0,null,171,0,0,0,0,null,171,0,0,0,0,null,171,0,0,0,0,null,171,0,0,0,0,null,171,0,0,0,0]
[172,0,0,0,0,null,172,0,0,0,0,null,172,0,0,0,0,null,172,0,0,0,0,null,172,0,0,0,0,null,172,0,0,0,0,null,172,0,0,0,0,null,172,0,0,0,0,null,172,0,0,0,0,null,172,0,0,0,0,null,172,0,0,0,0,null,172,0,0,0,0]
[173,0,0,0,0,null,173,0,0,0,0,null,173,0,0,0,0,null,173,0,0,0,0,null,173,0,0,0,0,null,173,0,0,0,0,null,173,0,0,0,0,null,173,0,0,0,0,null,173,0,0,0,0,null,173,0,0,0,0,null,173,0,0,0,0,null,173,0,0,0,0]
[174,0,0,0,0,null,174,0,0,0,0,null,174,0,0,0,0,null,174,0,0,0,0,null,174,0,0,0,0,null,174,0,0,0,0,null,174,0,0,0,0,null,174,0,0,0,0,null,174,0,0,0,0,null,174,0,0,0,0,null,174,0,0,0,0,null,174,0,0,0,0]
[175,0,0,0,0,null,175,0,0,0,0,null,175,0,0,0,0,null,175,0,0,0,0,null,175,0,0,0,0,null,175,0,0,0,0,null,175,0,0,0,0,null,175,0,0,0,0,null,175,0,0,0,0,null,175,0,0,0,0,null,175,0,0,0,0,null,175,0,0,0,0]
[176,0,0,0,0,null,176,0,0,0,0,null,176,0,0,0,0,null,176,0,0,0,0,null,176,0,0,0,0,null,176,0,0,0,0,null,176,0,0,0,0,null,176,0,0,0,0,null,176,0,0,0,0,null,176,0,0,0,0,null,176,0,0,0,0,null,176,0,0,0,0]
[177,0,0,0,0,null,177,0,0,0,0,null,177,0,0,0,0,null,177,0,0,0,0,null,177,0,0,0,0,null,177,0,0,0,0,null,177,0,0,0,0,null,177,0,0,0,0,null,177,0,0,0,0,null,177,0,0,0,0,null,177,0,0,0,0,null,177,0,0,0,0]
[178,0,0,0,0,null,178,0,0,0,0,null,178,0,0,0,0,null,178,0,0,0,0,null,178,0,0,0,0,null,178,0,0,0,0,null,178,0,0,0,0,null,178,0,0,0,0,null,178,0,0,0,0,null,178,0,0,0,0,null,178,0,0,0,0,null,178,0,0,0,0]
[179,0,0,0,0,null,179,0,0,0,0,null,179,0,0,0,0,null,179,0,0,0,0,null,179,0,0,0,0,null,179,0,0,0,0,null,179,0,0,0,0,null,179,0,0,0,0,null,179,0,0,0,0,null,179,0,0,0,0,null,179,0,0,0,0,null,179,0,0,0,0]
[180,0,0,0,0,null,180,0,0,0,0,null,180,0,0,0,0,null,180,0,0,0,0,null,180,0,0,0,0,null,180,0,0,0,0,null,180,0,0,0,0,null,180,0,0,0,0,null,180,0,0,0,0,null,180,0,0,0,0,null,180,0,0,0,0,null,180,0,0,0,0]
[181,0,0,0,0,null,181,0,0,0,0,null,181,0,0,0,0,null,181,0,0,0,0,null,181,0,0,0,0,null,181,0,0,0,0,null,181,0,0,0,0,null,181,0,0,0,0,null,181,0,0,0,0,null,181,0,0,0,0,null,181,0,0,0,0,null,181,0,0,0,0]
[182,0,0,0,0,null,182,0,0,0,0,null,182,0,0,0,0,null,182,0,0,0,0,null,182,0,0,0,0,null,182,0,0,0,0,null,182,0,0,0,0,null,182,0,0,0,0,null,182,0,0,0,0,null,182,0,0,0,0,null,182,0,0,0,0,null,182,0,0,0,0]
[183,0,0,0,0,null,183,0,0,0,0,null,183,0,0,0,0,null,183,0,0,0,0,null,183,0,0,0,0,null,183,0,0,0,0,null,183,0,0,0,0,null,183,0,0,0,0,null,183,0,0,0,0,null,183,0,0,0,0,null,183,0,0,0,0,null,183,0,0,0,0]
[184,0,0,0,0,null,184,0,0,0,0,null,184,0,0,0,0,null,184,0,0,0,0,null,184,0,0,0,0,null,184,0,0,0,0,null,184,0,0,0,0,null,184,0,0,0,0,null,184,0,0,0,0,null,184,0,0,0,0,null,184,0,0,0,0,null,184,0,0,0,0]
[185,0,0,0,0,null,185,0,0,0,0,null,185,0,0,0,0,null,185,0,0,0,0,null,185,0,0,0,0,null,185,0,0,0,0,null,185,0,0,0,0,null,185,0,0,0,0,null,185,0,0,0,0,null,185,0,0,0,0,null,185,0,0,0,0,null,185,0,0,0,0]
[186,0,0,0,0,null,186,0,0,0,0,null,186,0,0,0,0,null,186,0,0,0,0,null,186,0,0,0,0,null,186,0,0,0,0,null,186,0,0,0,0,null,186,0,0,0,0,null,186,0,0,0,0,null,186,0,0,0,0,null,186,0,0,0,0,null,186,0,0,0,0]
[187,0,0,0,0,null,187,0,0,0,0,null,187,0,0,0,0,null,187,0,0,0,0,null,187,0,0,0,0,null,187,0,0,0,0,null,187,0,0,0,0,null,187,0,0,0,0,null,187,0,0,0,0,null,187,0,0,0,0,null,187,0,0,0,0,null,187,0,0,0,0]
[188,0,0,0,0,null,188,0,0,0,0,null,188,0,0,0,0,null,188,0,0,0,0,null,188,0,0,0,0,null,188,0,0,0,0,null,188,0,0,0,0,null,188,0,0,0,0,null,188,0,0,0,0,null,188,0,0,0,0,null,188,0,0,0,0,null,188,0,0,0,0]
[189,0,0,0,0,null,189,0,0,0,0,null,189,0,0,0,0,null,189,0,0,0,0,null,189,0,0,0,0,null,189,0,0,0,0,null,189,0,0,0,0,null,189,0,0,0,0,null,189,0,0,0,0,null,189,0,0,0,0,null,189,0,0,0,0,null,189,0,0,0,0]
[190,0,0,0,0,null,190,0,0,0,0,null,190,0,0,0,0,null,190,0,0,0,0,null,190,0,0,0,0,null,190,0,0,0,0,null,190,0,0,0,0,null,190,0,0,0,0,null,190,0,0,0,0,null,190,0,0,0,0,null,190,0,0,0,0,null,190,0,0,0,0]
[191,0,0,0,0,null,191,0,0,0,0,null,191,0,0,0,0,null,191,0,0,0,0,null,191,0,0,0,0,null,191,0,0,0,0,null,191,0,0,0,0,null,191,0,0,0,0,null,191,0,0,0,0,null,191,0,0,0,0,null,191,0,0,0,0,null,191,0,0,0,0]
[192,0,0,0,0,null,192,0,0,0,0,null,192,0,0,0,0,null,192,0,0,0,0,null,192,0,0,0,0,null,192,0,0,0,0,null,192,0,0,0,0,null,192,0,0,0,0,null,192,0,0,0,0,null,192,0,0,0,0,null,192,0,0,0,0,null,192,0,0,0,0]
[193,0,0,0,0,null,193,0,0,0,0,null,193,0,0,0,0,null,193,0,0,0,0,null,193,0,0,0,0,null,193,0,0,0,0,null,193,0,0,0,0,null,193,0,0,0,0,null,193,0,0,0,0,null,193,0,0,0,0,null,193,0,0,0,0,null,193,0,0,0,0]
[194,0,0,0,{"$f":"IF((B204+C204-D204)>0,B204+C204-D204,0)","v":0},null,194,0,0,0,{"$f":"IF((H204+I204-J204)>0,H204+I204-J204,0)","v":0},null,194,0,0,0,{"$f":"IF((N204+O204-P204)>0,N204+O204-P204,0)","v":0},null,194,0,{"$f":"T204*$V$6","v":0},0,{"$f":"IF((T204+U204-V204)>0,T204+U204-V204,0)","v":0},null,194,0,{"$f":"Z204*$AB$6","v":0},0,{"$f":"IF((Z204+AA204-AB204)>0,Z204+AA204-AB204,0)","v":0},null,194,0,{"$f":"AF204*$AH$6","v":0},0,{"$f":"IF((AF204+AG204-AH204)>0,AF204+AG204-AH204,0)","v":0},null,194,0,{"$f":"AL204*$AN$6","v":0},0,0,null,194,0,{"$f":"AR204*$AT$6","v":0},0,{"$f":"IF((AR204+AS204-AT204)>0,AR204+AS204-AT204,0)","v":0},null,194,0,{"$f":"AX204*$AZ$6","v":0},0,{"$f":"IF((AX204+AY204-AZ204)>0,AX204+AY204-AZ204,0)","v":0},null,194,0,{"$f":"BD204*$BF$6","v":0},0,{"$f":"IF((BD204+BE204-BF204)>0,BD204+BE204-BF204,0)","v":0},null,194,0,{"$f":"BJ204*$BL$6","v":0},0,{"$f":"IF((BJ204+BK204-BL204)>0,BJ204+BK204-BL204,0)","v":0},null,194,0,{"$f":"BP204*$BR$6","v":0},0,{"$f":"IF((BP204+BQ204-BR204)>0,BP204+BQ204-BR204,0)","v":0}]
[195,{"$f":"E204","v":0},{"$f":"B205*$D$6","v":0},{"$f":"IF((E204)>0,$D$7,0)","v":0},0,null,195,{"$f":"K204","v":0},{"$f":"H205*$J$6","v":0},{"$f":"IF((K204)>0,IF(E204=0,$J$7+$D$7,$J$7),0)","v":0},0,null,195,{"$f":"Q204","v":0},{"$f":"N205*$P$6","v":0},{"$f":"IF((Q204)>0,IF(K204=0,$P$7+$J$7+$D$7,$P$7),0)","v":0},0,null,195,{"$f":"W204","v":0},0,{"$f":"IF((W204)>0,IF(Q204=0,$P$7+$J$7+$D$7+$V$7,$V$7),0)","v":0},0,null,195,{"$f":"AC204","v":0},0,{"$f":"IF((AC204)>0,IF(W204=0,$AB$7+$V$7+$P$7+$J$7+$D$7,$AB$7),0)","v":0},0,null,195,{"$f":"AI204","v":0},0,{"$f":"IF((AI204)>0,IF(AC204=0,$AH$7+$AB$7+$V$7+$P$7+$J$7+$D$7,$AH$7),0)","v":0},0,null,195,{"$f":"AO204","v":0},0,{"$f":"IF((AO204)>0,IF(AI204=0,$AN$7+$AH$7+$AB$7+$V$7+$P$7+$J$7+$D$7,$AN$7),0)","v":0},{"$f":"IF((AL205+AM205-AN205)>0,AL205+AM205-AN205,0)","v":0},null,195,{"$f":"AU204","v":0},0,{"$f":"IF((AU204)>0,IF(AO204=0,$AT$7+$AN$7+$AH$7+$AB$7+$V$7+$P$7+$J$7+$D$7,$AT$7),0)","v":0},0,null,195,{"$f":"BA204","v":0},0,{"$f":"IF((BA204)>0,IF(AU204=0,$AZ$7+$AT$7+$AN$7+$AH$7+$AB$7+$V$7+$P$7+$J$7+$D$7,$AZ$7),0)","v":0},0,null,195,{"$f":"BG204","v":0},0,{"$f":"IF((BG204)>0,IF(BA204=0,$BF$7+$AZ$7+$AT$7+$AN$7+$AH$7+$AB$7+$V$7+$P$7+$J$7+$D$7,$BF$7),0)","v":0},0,null,195,{"$f":"BM204","v":0},0,{"$f":"IF((BM204)>0,IF(BG204=0,$BL$7+$BF$7+$AZ$7+$AT$7+$AN$7+$AH$7+$AB$7+$V$7+$P$7+$J$7+$D$7,$BL$7),0)","v":0},0,null,195,{"$f":"BS204","v":0},0,{"$f":"IF((BS204)>0,IF(BM204=0,$BR$7+$BL$7+$BF$7+$AZ$7+$AT$7+$AN$7+$AH$7+$AB$7+$V$7+$P$7+$J$7+$D$7,$BR$7),0)","v":0},0]
[196,0,0,0,0,null,196,0,0,0,0,null,196,0,0,0,0,null,196,0,0,0,0,null,196,0,0,0,0,null,196,0,0,0,0,null,196,0,0,0,0,null,196,0,0,0,0,null,196,0,0,0,0,null,196,0,0,0,0,null,196,0,0,0,0,null,196,0,0,0,0]
[197,0,0,0,0,null,197,0,0,0,0,null,197,0,0,0,0,null,197,0,0,0,0,null,197,0,0,0,0,null,197,0,0,0,0,null,197,0,0,0,0,null,197,0,0,0,0,null,197,0,0,0,0,null,197,0,0,0,0,null,197,0,0,0,0,null,197,0,0,0,0]
[198,0,0,0,0,null,198,0,0,0,0,null,198,0,0,0,0,null,198,0,0,0,0,null,198,0,0,0,0,null,198,0,0,0,0,null,198,0,0,0,0,null,198,0,0,0,0,null,198,0,0,0,0,null,198,0,0,0,0,null,198,0,0,0,0,null,198,0,0,0,0]
[199,0,0,0,0,null,199,0,0,0,0,null,199,0,0,0,0,null,199,0,0,0,0,null,199,0,0,0,0,null,199,0,0,0,0,null,199,0,0,0,0,null,199,0,0,0,0,null,199,0,0,0,0,null,199,0,0,0,0,null,199,0,0,0,0,null,199,0,0,0,0]
[200,0,0,0,0,null,200,0,0,0,0,null,200,0,0,0,0,null,200,0,0,0,0,null,200,0,0,0,0,null,200,0,0,0,0,null,200,0,0,0,0,null,200,0,0,0,0,null,200,0,0,0,0,null,200,0,0,0,0,null,200,0,0,0,0,null,200,0,0,0,0]
[201,0,0,0,0,null,201,0,0,0,0,null,201,0,0,0,0,null,201,0,0,0,0,null,201,0,0,0,0,null,201,0,0,0,0,null,201,0,0,0,0,null,201,0,0,0,0,null,201,0,0,0,0,null,201,0,0,0,0,null,201,0,0,0,0,null,201,0,0,0,0]
[202,0,0,0,0,null,202,0,0,0,0,null,202,0,0,0,0,null,202,0,0,0,0,null,202,0,0,0,0,null,202,0,0,0,0,null,202,0,0,0,0,null,202,0,0,0,0,null,202,0,0,0,0,null,202,0,0,0,0,null,202,0,0,0,0,null,202,0,0,0,0]
[203,0,0,0,0,null,203,0,0,0,0,null,203,0,0,0,0,null,203,0,0,0,0,null,203,0,0,0,0,null,203,0,0,0,0,null,203,0,0,0,0,null,203,0,0,0,0,null,203,0,0,0,0,null,203,0,0,0,0,null,203,0,0,0,0,null,203,0,0,0,0]
[204,0,0,0,0,null,204,0,0,0,0,null,204,0,0,0,0,null,204,0,0,0,0,null,204,0,0,0,0,null,204,0,0,0,0,null,204,0,0,0,0,null,204,0,0,0,0,null,204,0,0,0,0,null,204,0,0,0,0,null,204,0,0,0,0,null,204,0,0,0,0]
[205,0,0,0,0,null,205,0,0,0,0,null,205,0,0,0,0,null,205,0,0,0,0,null,205,0,0,0,0,null,205,0,0,0,0,null,205,0,0,0,0,null,205,0,0,0,0,null,205,0,0,0,0,null,205,0,0,0,0,null,205,0,0,0,0,null,205,0,0,0,0]
[206,0,0,0,0,null,206,0,0,0,0,null,206,0,0,0,0,null,206,0,0,0,0,null,206,0,0,0,0,null,206,0,0,0,0,null,206,0,0,0,0,null,206,0,0,0,0,null,206,0,0,0,0,null,206,0,0,0,0,null,206,0,0,0,0,null,206,0,0,0,0]
[207,0,0,0,0,null,207,0,0,0,0,null,207,0,0,0,0,null,207,0,0,0,0,null,207,0,0,0,0,null,207,0,0,0,0,null,207,0,0,0,0,null,207,0,0,0,0,null,207,0,0,0,0,null,207,0,0,0,0,null,207,0,0,0,0,null,207,0,0,0,0]
[208,0,0,0,0,null,208,0,0,0,0,null,208,0,0,0,0,null,208,0,0,0,0,null,208,0,0,0,0,null,208,0,0,0,0,null,208,0,0,0,0,null,208,0,0,0,0,null,208,0,0,0,0,null,208,0,0,0,0,null,208,0,0,0,0,null,208,0,0,0,0]
[209,0,0,0,0,null,209,0,0,0,0,null,209,0,0,0,0,null,209,0,0,0,0,null,209,0,0,0,0,null,209,0,0,0,0,null,209,0,0,0,0,null,209,0,0,0,0,null,209,0,0,0,0,null,209,0,0,0,0,null,209,0,0,0,0,null,209,0,0,0,0]
[210,0,0,0,0,null,210,0,0,0,0,null,210,0,0,0,0,null,210,0,0,0,0,null,210,0,0,0,0,null,210,0,0,0,0,null,210,0,0,0,0,null,210,0,0,0,0,null,210,0,0,0,0,null,210,0,0,0,0,null,210,0,0,0,0,null,210,0,0,0,0]
[211,0,0,0,0,null,211,0,0,0,0,null,211,0,0,0,0,null,211,0,0,0,0,null,211,0,0,0,0,null,211,0,0,0,0,null,211,0,0,0,0,null,211,0,0,0,0,null,211,0,0,0,0,null,211,0,0,0,0,null,211,0,0,0,0,null,211,0,0,0,0]
[212,0,0,0,0,null,212,0,0,0,0,null,212,0,0,0,0,null,212,0,0,0,0,null,212,0,0,0,0,null,212,0,0,0,0,null,212,0,0,0,0,null,212,0,0,0,0,null,212,0,0,0,0,null,212,0,0,0,0,null,212,0,0,0,0,null,212,0,0,0,0]
[213,0,0,0,0,null,213,0,0,0,0,null,213,0,0,0,0,null,213,0,0,0,0,null,213,0,0,0,0,null,213,0,0,0,0,null,213,0,0,0,0,null,213,0,0,0,0,null,213,0,0,0,0,null,213,0,0,0,0,null,213,0,0,0,0,null,213,0,0,0,0]
[214,0,0,0,0,null,214,0,0,0,0,null,214,0,0,0,0,null,214,0,0,0,0,null,214,0,0,0,0,null,214,0,0,0,0,null,214,0,0,0,0,null,214,0,0,0,0,null,214,0,0,0,0,null,214,0,0,0,0,null,214,0,0,0,0,null,214,0,0,0,0]
[215,0,0,0,0,null,215,0,0,0,0,null,215,0,0,0,0,null,215,0,0,0,0,null,215,0,0,0,0,null,215,0,0,0,0,null,215,0,0,0,0,null,215,0,0,0,0,null,215,0,0,0,0,null,215,0,0,0,0,null,215,0,0,0,0,null,215,0,0,0,0]
[216,0,0,0,0,null,216,0,0,0,0,null,216,0,0,0,0,null,216,0,0,0,0,null,216,0,0,0,0,null,216,0,0,0,0,null,216,0,0,0,0,null,216,0,0,0,0,null,216,0,0,0,0,null,216,0,0,0,0,null,216,0,0,0,0,null,216,0,0,0,0]
[217,0,0,0,0,null,217,0,0,0,0,null,217,0,0,0,0,null,217,0,0,0,0,null,217,0,0,0,0,null,217,0,0,0,0,null,217,0,0,0,0,null,217,0,0,0,0,null,217,0,0,0,0,null,217,0,0,0,0,null,217,0,0,0,0,null,217,0,0,0,0]
[218,0,0,0,0,null,218,0,0,0,0,null,218,0,0,0,0,null,218,0,0,0,0,null,218,0,0,0,0,null,218,0,0,0,0,null,218,0,0,0,0,null,218,0,0,0,0,null,218,0,0,0,0,null,218,0,0,0,0,null,218,0,0,0,0,null,218,0,0,0,0]
[219,0,0,0,0,null,219,0,0,0,0,null,219,0,0,0,0,null,219,0,0,0,0,null,219,0,0,0,0,null,219,0,0,0,0,null,219,0,0,0,0,null,219,0,0,0,0,null,219,0,0,0,0,null,219,0,0,0,0,null,219,0,0,0,0,null,219,0,0,0,0]
[220,0,0,0,0,null,220,0,0,0,0,null,220,0,0,0,0,null,220,0,0,0,0,null,220,0,0,0,0,null,220,0,0,0,0,null,220,0,0,0,0,null,220,0,0,0,0,null,220,0,0,0,0,null,220,0,0,0,0,null,220,0,0,0,0,null,220,0,0,0,0]
[221,0,0,0,0,null,221,0,0,0,0,null,221,0,0,0,0,null,221,0,0,0,0,null,221,0,0,0,0,null,221,0,0,0,0,null,221,0,0,0,0,null,221,0,0,0,0,null,221,0,0,0,0,null,221,0,0,0,0,null,221,0,0,0,0,null,221,0,0,0,0]
[222,0,0,0,0,null,222,0,0,0,0,null,222,0,0,0,0,null,222,0,0,0,0,null,222,0,0,0,0,null,222,0,0,0,0,null,222,0,0,0,0,null,222,0,0,0,0,null,222,0,0,0,0,null,222,0,0,0,0,null,222,0,0,0,0,null,222,0,0,0,0]
[223,0,0,0,0,null,223,0,0,0,0,null,223,0,0,0,0,null,223,0,0,0,0,null,223,0,0,0,0,null,223,0,0,0,0,null,223,0,0,0,0,null,223,0,0,0,0,null,223,0,0,0,0,null,223,0,0,0,0,null,223,0,0,0,0,null,223,0,0,0,0]
[224,0,0,0,0,null,224,0,0,0,0,null,224,0,0,0,0,null,224,0,0,0,0,null,224,0,0,0,0,null,224,0,0,0,0,null,224,0,0,0,0,null,224,0,0,0,0,null,224,0,0,0,0,null,224,0,0,0,0,null,224,0,0,0,0,null,224,0,0,0,0]
[225,0,0,0,0,null,225,0,0,0,0,null,225,0,0,0,0,null,225,0,0,0,0,null,225,0,0,0,0,null,225,0,0,0,0,null,225,0,0,0,0,null,225,0,0,0,0,null,225,0,0,0,0,null,225,0,0,0,0,null,225,0,0,0,0,null,225,0,0,0,0]
[226,0,0,0,0,null,226,0,0,0,0,null,226,0,0,0,0,null,226,0,0,0,0,null,226,0,0,0,0,null,226,0,0,0,0,null,226,0,0,0,0,null,226,0,0,0,0,null,226,0,0,0,0,null,226,0,0,0,0,null,226,0,0,0,0,null,226,0,0,0,0]
[227,0,0,0,0,null,227,0,0,0,0,null,227,0,0,0,0,null,227,0,0,0,0,null,227,0,0,0,0,null,227,0,0,0,0,null,227,0,0,0,0,null,227,0,0,0,0,null,227,0,0,0,0,null,227,0,0,0,0,null,227,0,0,0,0,null,227,0,0,0,0]
[228,0,0,0,0,null,228,0,0,0,0,null,228,0,0,0,0,null,228,0,0,0,0,null,228,0,0,0,0,null,228,0,0,0,0,null,228,0,0,0,0,null,228,0,0,0,0,null,228,0,0,0,0,null,228,0,0,0,0,null,228,0,0,0,0,null,228,0,0,0,0]
[229,0,0,0,0,null,229,0,0,0,0,null,229,0,0,0,0,null,229,0,0,0,0,null,229,0,0,0,0,null,229,0,0,0,0,null,229,0,0,0,0,null,229,0,0,0,0,null,229,0,0,0,0,null,229,0,0,0,0,null,229,0,0,0,0,null,229,0,0,0,0]
[230,0,0,0,0,null,230,0,0,0,0,null,230,0,0,0,0,null,230,0,0,0,0,null,230,0,0,0,0,null,230,0,0,0,0,null,230,0,0,0,0,null,230,0,0,0,0,null,230,0,0,0,0,null,230,0,0,0,0,null,230,0,0,0,0,null,230,0,0,0,0]
[231,0,0,0,0,null,231,0,0,0,0,null,231,0,0,0,0,null,231,0,0,0,0,null,231,0,0,0,0,null,231,0,0,0,0,null,231,0,0,0,0,null,231,0,0,0,0,null,231,0,0,0,0,null,231,0,0,0,0,null,231,0,0,0,0,null,231,0,0,0,0]
[232,0,0,0,0,null,232,0,0,0,0,null,232,0,0,0,0,null,232,0,0,0,0,null,232,0,0,0,0,null,232,0,0,0,0,null,232,0,0,0,0,null,232,0,0,0,0,null,232,0,0,0,0,null,232,0,0,0,0,null,232,0,0,0,0,null,232,0,0,0,0]
[233,0,0,0,0,null,233,0,0,0,0,null,233,0,0,0,0,null,233,0,0,0,0,null,233,0,0,0,0,null,233,0,0,0,0,null,233,0,0,0,0,null,233,0,0,0,0,null,233,0,0,0,0,null,233,0,0,0,0,null,233,0,0,0,0,null,233,0,0,0,0]
[234,0,0,0,0,null,234,0,0,0,0,null,234,0,0,0,0,null,234,0,0,0,0,null,234,0,0,0,0,null,234,0,0,0,0,null,234,0,0,0,0,null,234,0,0,0,0,null,234,0,0,0,0,null,234,0,0,0,0,null,234,0,0,0,0,null,234,0,0,0,0]
[235,0,0,0,0,null,235,0,0,0,0,null,235,0,0,0,0,null,235,0,0,0,0,null,235,0,0,0,0,null,235,0,0,0,0,null,235,0,0,0,0,null,235,0,0,0,0,null,235,0,0,0,0,null,235,0,0,0,0,null,235,0,0,0,0,null,235,0,0,0,0]
[236,0,0,0,0,null,236,0,0,0,0,null,236,0,0,0,0,null,236,0,0,0,0,null,236,0,0,0,0,null,236,0,0,0,0,null,236,0,0,0,0,null,236,0,0,0,0,null,236,0,0,0,0,null,236,0,0,0,0,null,236,0,0,0,0,null,236,0,0,0,0]
[237,0,0,0,0,null,237,0,0,0,0,null,237,0,0,0,0,null,237,0,0,0,0,null,237,0,0,0,0,null,237,0,0,0,0,null,237,0,0,0,0,null,237,0,0,0,0,null,237,0,0,0,0,null,237,0,0,0,0,null,237,0,0,0,0,null,237,0,0,0,0]
[238,0,0,0,0,null,238,0,0,0,0,null,238,0,0,0,0,null,238,0,0,0,0,null,238,0,0,0,0,null,238,0,0,0,0,null,238,0,0,0,0,null,238,0,0,0,0,null,238,0,0,0,0,null,238,0,0,0,0,null,238,0,0,0,0,null,238,0,0,0,0]
[239,0,0,0,0,null,239,0,0,0,0,null,239,0,0,0,0,null,239,0,0,0,0,null,239,0,0,0,0,null,239,0,0,0,0,null,239,0,0,0,0,null,239,0,0,0,0,null,239,0,0,0,0,null,239,0,0,0,0,null,239,0,0,0,0,null,239,0,0,0,0]
[240,0,0,0,0,null,240,0,0,0,0,null,240,0,0,0,0,null,240,0,0,0,0,null,240,0,0,0,0,null,240,0,0,0,0,null,240,0,0,0,0,null,240,0,0,0,0,null,240,0,0,0,0,null,240,0,0,0,0,null,240,0,0,0,0,null,240,0,0,0,0]
[241,0,0,0,0,null,241,0,0,0,0,null,241,0,0,0,0,null,241,0,0,0,0,null,241,0,0,0,0,null,241,0,0,0,0,null,241,0,0,0,0,null,241,0,0,0,0,null,241,0,0,0,0,null,241,0,0,0,0,null,241,0,0,0,0,null,241,0,0,0,0]
[242,0,0,0,0,null,242,0,0,0,0,null,242,0,0,0,0,null,242,0,0,0,0,null,242,0,0,0,0,null,242,0,0,0,0,null,242,0,0,0,0,null,242,0,0,0,0,null,242,0,0,0,0,null,242,0,0,0,0,null,242,0,0,0,0,null,242,0,0,0,0]
[243,0,0,0,0,null,243,0,0,0,0,null,243,0,0,0,0,null,243,0,0,0,0,null,243,0,0,0,0,null,243,0,0,0,0,null,243,0,0,0,0,null,243,0,0,0,0,null,243,0,0,0,0,null,243,0,0,0,0,null,243,0,0,0,0,null,243,0,0,0,0]
[244,0,0,0,0,null,244,0,0,0,0,null,244,0,0,0,0,null,244,0,0,0,0,null,244,0,0,0,0,null,244,0,0,0,0,null,244,0,0,0,0,null,244,0,0,0,0,null,244,0,0,0,0,null,244,0,0,0,0,null,244,0,0,0,0,null,244,0,0,0,0]
[245,0,0,0,0,null,245,0,0,0,0,null,245,0,0,0,0,null,245,0,0,0,0,null,245,0,0,0,0,null,245,0,0,0,0,null,245,0,0,0,0,null,245,0,0,0,0,null,245,0,0,0,0,null,245,0,0,0,0,null,245,0,0,0,0,null,245,0,0,0,0]
[246,0,0,0,0,null,246,0,0,0,0,null,246,0,0,0,0,null,246,0,0,0,0,null,246,0,0,0,0,null,246,0,0,0,0,null,246,0,0,0,0,null,246,0,0,0,0,null,246,0,0,0,0,null,246,0,0,0,0,null,246,0,0,0,0,null,246,0,0,0,0]
[247,0,0,0,0,null,247,0,0,0,0,null,247,0,0,0,0,null,247,0,0,0,0,null,247,0,0,0,0,null,247,0,0,0,0,null,247,0,0,0,0,null,247,0,0,0,0,null,247,0,0,0,0,null,247,0,0,0,0,null,247,0,0,0,0,null,247,0,0,0,0]
[248,0,0,0,0,null,248,0,0,0,0,null,248,0,0,0,0,null,248,0,0,0,0,null,248,0,0,0,0,null,248,0,0,0,0,null,248,0,0,0,0,null,248,0,0,0,0,null,248,0,0,0,0,null,248,0,0,0,0,null,248,0,0,0,0,null,248,0,0,0,0]
[249,0,0,0,0,null,249,0,0,0,0,null,249,0,0,0,0,null,249,0,0,0,0,null,249,0,0,0,0,null,249,0,0,0,0,null,249,0,0,0,0,null,249,0,0,0,0,null,249,0,0,0,0,null,249,0,0,0,0,null,249,0,0,0,0,null,249,0,0,0,0]
[250,0,0,0,0,null,250,0,0,0,0,null,250,0,0,0,0,null,250,0,0,0,0,null,250,0,0,0,0,null,250,0,0,0,0,null,250,0,0,0,0,null,250,0,0,0,0,null,250,0,0,0,0,null,250,0,0,0,0,null,250,0,0,0,0,null,250,0,0,0,0]
[251,0,0,0,0,null,251,0,0,0,0,null,251,0,0,0,0,null,251,0,0,0,0,null,251,0,0,0,0,null,251,0,0,0,0,null,251,0,0,0,0,null,251,0,0,0,0,null,251,0,0,0,0,null,251,0,0,0,0,null,251,0,0,0,0,null,251,0,0,0,0]
[252,0,0,0,0,null,252,0,0,0,0,null,252,0,0,0,0,null,252,0,0,0,0,null,252,0,0,0,0,null,252,0,0,0,0,null,252,0,0,0,0,null,252,0,0,0,0,null,252,0,0,0,0,null,252,0,0,0,0,null,252,0,0,0,0,null,252,0,0,0,0]
[253,0,0,0,0,null,253,0,0,0,0,null,253,0,0,0,0,null,253,0,0,0,0,null,253,0,0,0,0,null,253,0,0,0,0,null,253,0,0,0,0,null,253,0,0,0,0,null,253,0,0,0,0,null,253,0,0,0,0,null,253,0,0,0,0,null,253,0,0,0,0]
[254,0,0,0,0,null,254,0,0,0,0,null,254,0,0,0,0,null,254,0,0,0,0,null,254,0,0,0,0,null,254,0,0,0,0,null,254,0,0,0,0,null,254,0,0,0,0,null,254,0,0,0,0,null,254,0,0,0,0,null,254,0,0,0,0,null,254,0,0,0,0]
[255,0,0,0,0,null,255,0,0,0,0,null,255,0,0,0,0,null,255,0,0,0,0,null,255,0,0,0,0,null,255,0,0,0,0,null,255,0,0,0,0,null,255,0,0,0,0,null,255,0,0,0,0,null,255,0,0,0,0,null,255,0,0,0,0,null,255,0,0,0,0]
[256,0,0,0,0,null,256,0,0,0,0,null,256,0,0,0,0,null,256,0,0,0,0,null,256,0,0,0,0,null,256,0,0,0,0,null,256,0,0,0,0,null,256,0,0,0,0,null,256,0,0,0,0,null,256,0,0,0,0,null,256,0,0,0,0,null,256,0,0,0,0]
[257,0,0,0,0,null,257,0,0,0,0,null,257,0,0,0,0,null,257,0,0,0,0,null,257,0,0,0,0,null,257,0,0,0,0,null,257,0,0,0,0,null,257,0,0,0,0,null,257,0,0,0,0,null,257,0,0,0,0,null,257,0,0,0,0,null,257,0,0,0,0]
[258,0,0,0,{"$f":"IF((B268+C268-D268)>0,B268+C268-D268,0)","v":0},null,258,0,0,0,{"$f":"IF((H268+I268-J268)>0,H268+I268-J268,0)","v":0},null,258,0,0,0,{"$f":"IF((N268+O268-P268)>0,N268+O268-P268,0)","v":0},null,258,0,{"$f":"T268*$V$6","v":0},0,{"$f":"IF((T268+U268-V268)>0,T268+U268-V268,0)","v":0},null,258,0,{"$f":"Z268*$AB$6","v":0},0,{"$f":"IF((Z268+AA268-AB268)>0,Z268+AA268-AB268,0)","v":0},null,258,0,{"$f":"AF268*$AH$6","v":0},0,{"$f":"IF((AF268+AG268-AH268)>0,AF268+AG268-AH268,0)","v":0},null,258,0,{"$f":"AL268*$AN$6","v":0},0,0,null,258,0,{"$f":"AR268*$AT$6","v":0},0,{"$f":"IF((AR268+AS268-AT268)>0,AR268+AS268-AT268,0)","v":0},null,258,0,{"$f":"AX268*$AZ$6","v":0},0,{"$f":"IF((AX268+AY268-AZ268)>0,AX268+AY268-AZ268,0)","v":0},null,258,0,{"$f":"BD268*$BF$6","v":0},0,{"$f":"IF((BD268+BE268-BF268)>0,BD268+BE268-BF268,0)","v":0},null,258,0,{"$f":"BJ268*$BL$6","v":0},0,{"$f":"IF((BJ268+BK268-BL268)>0,BJ268+BK268-BL268,0)","v":0},null,258,0,{"$f":"BP268*$BR$6","v":0},0,{"$f":"IF((BP268+BQ268-BR268)>0,BP268+BQ268-BR268,0)","v":0}]
[259,{"$f":"E268","v":0},{"$f":"B269*$D$6","v":0},{"$f":"IF((E268)>0,$D$7,0)","v":0},0,null,259,{"$f":"K268","v":0},{"$f":"H269*$J$6","v":0},{"$f":"IF((K268)>0,IF(E268=0,$J$7+$D$7,$J$7),0)","v":0},0,null,259,{"$f":"Q268","v":0},{"$f":"N269*$P$6","v":0},{"$f":"IF((Q268)>0,IF(K268=0,$P$7+$J$7+$D$7,$P$7),0)","v":0},0,null,259,{"$f":"W268","v":0},0,{"$f":"IF((W268)>0,IF(Q268=0,$P$7+$J$7+$D$7+$V$7,$V$7),0)","v":0},0,null,259,{"$f":"AC268","v":0},0,{"$f":"IF((AC268)>0,IF(W268=0,$AB$7+$V$7+$P$7+$J$7+$D$7,$AB$7),0)","v":0},0,null,259,{"$f":"AI268","v":0},0,{"$f":"IF((AI268)>0,IF(AC268=0,$AH$7+$AB$7+$V$7+$P$7+$J$7+$D$7,$AH$7),0)","v":0},0,null,259,{"$f":"AO268","v":0},0,{"$f":"IF((AO268)>0,IF(AI268=0,$AN$7+$AH$7+$AB$7+$V$7+$P$7+$J$7+$D$7,$AN$7),0)","v":0},{"$f":"IF((AL269+AM269-AN269)>0,AL269+AM269-AN269,0)","v":0},null,259,{"$f":"AU268","v":0},0,{"$f":"IF((AU268)>0,IF(AO268=0,$AT$7+$AN$7+$AH$7+$AB$7+$V$7+$P$7+$J$7+$D$7,$AT$7),0)","v":0},0,null,259,{"$f":"BA268","v":0},0,{"$f":"IF((BA268)>0,IF(AU268=0,$AZ$7+$AT$7+$AN$7+$AH$7+$AB$7+$V$7+$P$7+$J$7+$D$7,$AZ$7),0)","v":0},0,null,259,{"$f":"BG268","v":0},0,{"$f":"IF((BG268)>0,IF(BA268=0,$BF$7+$AZ$7+$AT$7+$AN$7+$AH$7+$AB$7+$V$7+$P$7+$J$7+$D$7,$BF$7),0)","v":0},0,null,259,{"$f":"BM268","v":0},0,{"$f":"IF((BM268)>0,IF(BG268=0,$BL$7+$BF$7+$AZ$7+$AT$7+$AN$7+$AH$7+$AB$7+$V$7+$P$7+$J$7+$D$7,$BL$7),0)","v":0},0,null,259,{"$f":"BS268","v":0},0,{"$f":"IF((BS268)>0,IF(BM268=0,$BR$7+$BL$7+$BF$7+$AZ$7+$AT$7+$AN$7+$AH$7+$AB$7+$V$7+$P$7+$J$7+$D$7,$BR$7),0)","v":0},0]
[260,0,0,0,0,null,260,0,0,0,0,null,260,0,0,0,0,null,260,0,0,0,0,null,260,0,0,0,0,null,260,0,0,0,0,null,260,0,0,0,0,null,260,0,0,0,0,null,260,0,0,0,0,null,260,0,0,0,0,null,260,0,0,0,0,null,260,0,0,0,0]
[261,0,0,0,0,null,261,0,0,0,0,null,261,0,0,0,0,null,261,0,0,0,0,null,261,0,0,0,0,null,261,0,0,0,0,null,261,0,0,0,0,null,261,0,0,0,0,null,261,0,0,0,0,null,261,0,0,0,0,null,261,0,0,0,0,null,261,0,0,0,0]
[262,0,0,0,0,null,262,0,0,0,0,null,262,0,0,0,0,null,262,0,0,0,0,null,262,0,0,0,0,null,262,0,0,0,0,null,262,0,0,0,0,null,262,0,0,0,0,null,262,0,0,0,0,null,262,0,0,0,0,null,262,0,0,0,0,null,262,0,0,0,0]
[263,0,0,0,0,null,263,0,0,0,0,null,263,0,0,0,0,null,263,0,0,0,0,null,263,0,0,0,0,null,263,0,0,0,0,null,263,0,0,0,0,null,263,0,0,0,0,null,263,0,0,0,0,null,263,0,0,0,0,null,263,0,0,0,0,null,263,0,0,0,0]
[264,0,0,0,0,null,264,0,0,0,0,null,264,0,0,0,0,null,264,0,0,0,0,null,264,0,0,0,0,null,264,0,0,0,0,null,264,0,0,0,0,null,264,0,0,0,0,null,264,0,0,0,0,null,264,0,0,0,0,null,264,0,0,0,0,null,264,0,0,0,0]
[265,0,0,0,0,null,265,0,0,0,0,null,265,0,0,0,0,null,265,0,0,0,0,null,265,0,0,0,0,null,265,0,0,0,0,null,265,0,0,0,0,null,265,0,0,0,0,null,265,0,0,0,0,null,265,0,0,0,0,null,265,0,0,0,0,null,265,0,0,0,0]
[266,0,0,0,0,null,266,0,0,0,0,null,266,0,0,0,0,null,266,0,0,0,0,null,266,0,0,0,0,null,266,0,0,0,0,null,266,0,0,0,0,null,266,0,0,0,0,null,266,0,0,0,0,null,266,0,0,0,0,null,266,0,0,0,0,null,266,0,0,0,0]
[267,0,0,0,0,null,267,0,0,0,0,null,267,0,0,0,0,null,267,0,0,0,0,null,267,0,0,0,0,null,267,0,0,0,0,null,267,0,0,0,0,null,267,0,0,0,0,null,267,0,0,0,0,null,267,0,0,0,0,null,267,0,0,0,0,null,267,0,0,0,0]
[268,0,0,0,0,null,268,0,0,0,0,null,268,0,0,0,0,null,268,0,0,0,0,null,268,0,0,0,0,null,268,0,0,0,0,null,268,0,0,0,0,null,268,0,0,0,0,null,268,0,0,0,0,null,268,0,0,0,0,null,268,0,0,0,0,null,268,0,0,0,0]
[269,0,0,0,0,null,269,0,0,0,0,null,269,0,0,0,0,null,269,0,0,0,0,null,269,0,0,0,0,null,269,0,0,0,0,null,269,0,0,0,0,null,269,0,0,0,0,null,269,0,0,0,0,null,269,0,0,0,0,null,269,0,0,0,0,null,269,0,0,0,0]
[270,0,0,0,0,null,270,0,0,0,0,null,270,0,0,0,0,null,270,0,0,0,0,null,270,0,0,0,0,null,270,0,0,0,0,null,270,0,0,0,0,null,270,0,0,0,0,null,270,0,0,0,0,null,270,0,0,0,0,null,270,0,0,0,0,null,270,0,0,0,0]
[271,0,0,0,0,null,271,0,0,0,0,null,271,0,0,0,0,null,271,0,0,0,0,null,271,0,0,0,0,null,271,0,0,0,0,null,271,0,0,0,0,null,271,0,0,0,0,null,271,0,0,0,0,null,271,0,0,0,0,null,271,0,0,0,0,null,271,0,0,0,0]
[272,0,0,0,0,null,272,0,0,0,0,null,272,0,0,0,0,null,272,0,0,0,0,null,272,0,0,0,0,null,272,0,0,0,0,null,272,0,0,0,0,null,272,0,0,0,0,null,272,0,0,0,0,null,272,0,0,0,0,null,272,0,0,0,0,null,272,0,0,0,0]
[273,0,0,0,0,null,273,0,0,0,0,null,273,0,0,0,0,null,273,0,0,0,0,null,273,0,0,0,0,null,273,0,0,0,0,null,273,0,0,0,0,null,273,0,0,0,0,null,273,0,0,0,0,null,273,0,0,0,0,null,273,0,0,0,0,null,273,0,0,0,0]
[274,0,0,0,0,null,274,0,0,0,0,null,274,0,0,0,0,null,274,0,0,0,0,null,274,0,0,0,0,null,274,0,0,0,0,null,274,0,0,0,0,null,274,0,0,0,0,null,274,0,0,0,0,null,274,0,0,0,0,null,274,0,0,0,0,null,274,0,0,0,0]
[275,0,0,0,0,null,275,0,0,0,0,null,275,0,0,0,0,null,275,0,0,0,0,null,275,0,0,0,0,null,275,0,0,0,0,null,275,0,0,0,0,null,275,0,0,0,0,null,275,0,0,0,0,null,275,0,0,0,0,null,275,0,0,0,0,null,275,0,0,0,0]
[276,0,0,0,0,null,276,0,0,0,0,null,276,0,0,0,0,null,276,0,0,0,0,null,276,0,0,0,0,null,276,0,0,0,0,null,276,0,0,0,0,null,276,0,0,0,0,null,276,0,0,0,0,null,276,0,0,0,0,null,276,0,0,0,0,null,276,0,0,0,0]
[277,0,0,0,0,null,277,0,0,0,0,null,277,0,0,0,0,null,277,0,0,0,0,null,277,0,0,0,0,null,277,0,0,0,0,null,277,0,0,0,0,null,277,0,0,0,0,null,277,0,0,0,0,null,277,0,0,0,0,null,277,0,0,0,0,null,277,0,0,0,0]
[278,0,0,0,0,null,278,0,0,0,0,null,278,0,0,0,0,null,278,0,0,0,0,null,278,0,0,0,0,null,278,0,0,0,0,null,278,0,0,0,0,null,278,0,0,0,0,null,278,0,0,0,0,null,278,0,0,0,0,null,278,0,0,0,0,null,278,0,0,0,0]
[279,0,0,0,0,null,279,0,0,0,0,null,279,0,0,0,0,null,279,0,0,0,0,null,279,0,0,0,0,null,279,0,0,0,0,null,279,0,0,0,0,null,279,0,0,0,0,null,279,0,0,0,0,null,279,0,0,0,0,null,279,0,0,0,0,null,279,0,0,0,0]
[280,0,0,0,0,null,280,0,0,0,0,null,280,0,0,0,0,null,280,0,0,0,0,null,280,0,0,0,0,null,280,0,0,0,0,null,280,0,0,0,0,null,280,0,0,0,0,null,280,0,0,0,0,null,280,0,0,0,0,null,280,0,0,0,0,null,280,0,0,0,0]
[281,0,0,0,0,null,281,0,0,0,0,null,281,0,0,0,0,null,281,0,0,0,0,null,281,0,0,0,0,null,281,0,0,0,0,null,281,0,0,0,0,null,281,0,0,0,0,null,281,0,0,0,0,null,281,0,0,0,0,null,281,0,0,0,0,null,281,0,0,0,0]
[282,0,0,0,0,null,282,0,0,0,0,null,282,0,0,0,0,null,282,0,0,0,0,null,282,0,0,0,0,null,282,0,0,0,0,null,282,0,0,0,0,null,282,0,0,0,0,null,282,0,0,0,0,null,282,0,0,0,0,null,282,0,0,0,0,null,282,0,0,0,0]
[283,0,0,0,0,null,283,0,0,0,0,null,283,0,0,0,0,null,283,0,0,0,0,null,283,0,0,0,0,null,283,0,0,0,0,null,283,0,0,0,0,null,283,0,0,0,0,null,283,0,0,0,0,null,283,0,0,0,0,null,283,0,0,0,0,null,283,0,0,0,0]
[284,0,0,0,0,null,284,0,0,0,0,null,284,0,0,0,0,null,284,0,0,0,0,null,284,0,0,0,0,null,284,0,0,0,0,null,284,0,0,0,0,null,284,0,0,0,0,null,284,0,0,0,0,null,284,0,0,0,0,null,284,0,0,0,0,null,284,0,0,0,0]
[285,0,0,0,0,null,285,0,0,0,0,null,285,0,0,0,0,null,285,0,0,0,0,null,285,0,0,0,0,null,285,0,0,0,0,null,285,0,0,0,0,null,285,0,0,0,0,null,285,0,0,0,0,null,285,0,0,0,0,null,285,0,0,0,0,null,285,0,0,0,0]
[286,0,0,0,0,null,286,0,0,0,0,null,286,0,0,0,0,null,286,0,0,0,0,null,286,0,0,0,0,null,286,0,0,0,0,null,286,0,0,0,0,null,286,0,0,0,0,null,286,0,0,0,0,null,286,0,0,0,0,null,286,0,0,0,0,null,286,0,0,0,0]
[287,0,0,0,0,null,287,0,0,0,0,null,287,0,0,0,0,null,287,0,0,0,0,null,287,0,0,0,0,null,287,0,0,0,0,null,287,0,0,0,0,null,287,0,0,0,0,null,287,0,0,0,0,null,287,0,0,0,0,null,287,0,0,0,0,null,287,0,0,0,0]
[288,0,0,0,0,null,288,0,0,0,0,null,288,0,0,0,0,null,288,0,0,0,0,null,288,0,0,0,0,null,288,0,0,0,0,null,288,0,0,0,0,null,288,0,0,0,0,null,288,0,0,0,0,null,288,0,0,0,0,null,288,0,0,0,0,null,288,0,0,0,0]
[289,0,0,0,0,null,289,0,0,0,0,null,289,0,0,0,0,null,289,0,0,0,0,null,289,0,0,0,0,null,289,0,0,0,0,null,289,0,0,0,0,null,289,0,0,0,0,null,289,0,0,0,0,null,289,0,0,0,0,null,289,0,0,0,0,null,289,0,0,0,0]
[290,0,0,0,0,null,290,0,0,0,0,null,290,0,0,0,0,null,290,0,0,0,0,null,290,0,0,0,0,null,290,0,0,0,0,null,290,0,0,0,0,null,290,0,0,0,0,null,290,0,0,0,0,null,290,0,0,0,0,null,290,0,0,0,0,null,290,0,0,0,0]
[291,0,0,0,0,null,291,0,0,0,0,null,291,0,0,0,0,null,291,0,0,0,0,null,291,0,0,0,0,null,291,0,0,0,0,null,291,0,0,0,0,null,291,0,0,0,0,null,291,0,0,0,0,null,291,0,0,0,0,null,291,0,0,0,0,null,291,0,0,0,0]
[292,0,0,0,0,null,292,0,0,0,0,null,292,0,0,0,0,null,292,0,0,0,0,null,292,0,0,0,0,null,292,0,0,0,0,null,292,0,0,0,0,null,292,0,0,0,0,null,292,0,0,0,0,null,292,0,0,0,0,null,292,0,0,0,0,null,292,0,0,0,0]
[293,0,0,0,0,null,293,0,0,0,0,null,293,0,0,0,0,null,293,0,0,0,0,null,293,0,0,0,0,null,293,0,0,0,0,null,293,0,0,0,0,null,293,0,0,0,0,null,293,0,0,0,0,null,293,0,0,0,0,null,293,0,0,0,0,null,293,0,0,0,0]
[294,0,0,0,0,null,294,0,0,0,0,null,294,0,0,0,0,null,294,0,0,0,0,null,294,0,0,0,0,null,294,0,0,0,0,null,294,0,0,0,0,null,294,0,0,0,0,null,294,0,0,0,0,null,294,0,0,0,0,null,294,0,0,0,0,null,294,0,0,0,0]
[295,0,0,0,0,null,295,0,0,0,0,null,295,0,0,0,0,null,295,0,0,0,0,null,295,0,0,0,0,null,295,0,0,0,0,null,295,0,0,0,0,null,295,0,0,0,0,null,295,0,0,0,0,null,295,0,0,0,0,null,295,0,0,0,0,null,295,0,0,0,0]
[296,0,0,0,0,null,296,0,0,0,0,null,296,0,0,0,0,null,296,0,0,0,0,null,296,0,0,0,0,null,296,0,0,0,0,null,296,0,0,0,0,null,296,0,0,0,0,null,296,0,0,0,0,null,296,0,0,0,0,null,296,0,0,0,0,null,296,0,0,0,0]
[297,0,0,0,0,null,297,0,0,0,0,null,297,0,0,0,0,null,297,0,0,0,0,null,297,0,0,0,0,null,297,0,0,0,0,null,297,0,0,0,0,null,297,0,0,0,0,null,297,0,0,0,0,null,297,0,0,0,0,null,297,0,0,0,0,null,297,0,0,0,0]
[298,0,0,0,0,null,298,0,0,0,0,null,298,0,0,0,0,null,298,0,0,0,0,null,298,0,0,0,0,null,298,0,0,0,0,null,298,0,0,0,0,null,298,0,0,0,0,null,298,0,0,0,0,null,298,0,0,0,0,null,298,0,0,0,0,null,298,0,0,0,0]
[299,0,0,0,0,null,299,0,0,0,0,null,299,0,0,0,0,null,299,0,0,0,0,null,299,0,0,0,0,null,299,0,0,0,0,null,299,0,0,0,0,null,299,0,0,0,0,null,299,0,0,0,0,null,299,0,0,0,0,null,299,0,0,0,0,null,299,0,0,0,0]
[300,0,0,0,0,null,300,0,0,0,0,null,300,0,0,0,0,null,300,0,0,0,0,null,300,0,0,0,0,null,300,0,0,0,0,null,300,0,0,0,0,null,300,0,0,0,0,null,300,0,0,0,0,null,300,0,0,0,0,null,300,0,0,0,0,null,300,0,0,0,0]
[301,0,0,0,0,null,301,0,0,0,0,null,301,0,0,0,0,null,301,0,0,0,0,null,301,0,0,0,0,null,301,0,0,0,0,null,301,0,0,0,0,null,301,0,0,0,0,null,301,0,0,0,0,null,301,0,0,0,0,null,301,0,0,0,0,null,301,0,0,0,0]
[302,0,0,0,0,null,302,0,0,0,0,null,302,0,0,0,0,null,302,0,0,0,0,null,302,0,0,0,0,null,302,0,0,0,0,null,302,0,0,0,0,null,302,0,0,0,0,null,302,0,0,0,0,null,302,0,0,0,0,null,302,0,0,0,0,null,302,0,0,0,0]
[303,0,0,0,0,null,303,0,0,0,0,null,303,0,0,0,0,null,303,0,0,0,0,null,303,0,0,0,0,null,303,0,0,0,0,null,303,0,0,0,0,null,303,0,0,0,0,null,303,0,0,0,0,null,303,0,0,0,0,null,303,0,0,0,0,null,303,0,0,0,0]
[304,0,0,0,0,null,304,0,0,0,0,null,304,0,0,0,0,null,304,0,0,0,0,null,304,0,0,0,0,null,304,0,0,0,0,null,304,0,0,0,0,null,304,0,0,0,0,null,304,0,0,0,0,null,304,0,0,0,0,null,304,0,0,0,0,null,304,0,0,0,0]
[305,0,0,0,0,null,305,0,0,0,0,null,305,0,0,0,0,null,305,0,0,0,0,null,305,0,0,0,0,null,305,0,0,0,0,null,305,0,0,0,0,null,305,0,0,0,0,null,305,0,0,0,0,null,305,0,0,0,0,null,305,0,0,0,0,null,305,0,0,0,0]
[306,0,0,0,0,null,306,0,0,0,0,null,306,0,0,0,0,null,306,0,0,0,0,null,306,0,0,0,0,null,306,0,0,0,0,null,306,0,0,0,0,null,306,0,0,0,0,null,306,0,0,0,0,null,306,0,0,0,0,null,306,0,0,0,0,null,306,0,0,0,0]
[307,0,0,0,0,null,307,0,0,0,0,null,307,0,0,0,0,null,307,0,0,0,0,null,307,0,0,0,0,null,307,0,0,0,0,null,307,0,0,0,0,null,307,0,0,0,0,null,307,0,0,0,0,null,307,0,0,0,0,null,307,0,0,0,0,null,307,0,0,0,0]
[308,0,0,0,0,null,308,0,0,0,0,null,308,0,0,0,0,null,308,0,0,0,0,null,308,0,0,0,0,null,308,0,0,0,0,null,308,0,0,0,0,null,308,0,0,0,0,null,308,0,0,0,0,null,308,0,0,0,0,null,308,0,0,0,0,null,308,0,0,0,0]
[309,0,0,0,0,null,309,0,0,0,0,null,309,0,0,0,0,null,309,0,0,0,0,null,309,0,0,0,0,null,309,0,0,0,0,null,309,0,0,0,0,null,309,0,0,0,0,null,309,0,0,0,0,null,309,0,0,0,0,null,309,0,0,0,0,null,309,0,0,0,0]
[310,0,0,0,0,null,310,0,0,0,0,null,310,0,0,0,0,null,310,0,0,0,0,null,310,0,0,0,0,null,310,0,0,0,0,null,310,0,0,0,0,null,310,0,0,0,0,null,310,0,0,0,0,null,310,0,0,0,0,null,310,0,0,0,0,null,310,0,0,0,0]
[311,0,0,0,0,null,311,0,0,0,0,null,311,0,0,0,0,null,311,0,0,0,0,null,311,0,0,0,0,null,311,0,0,0,0,null,311,0,0,0,0,null,311,0,0,0,0,null,311,0,0,0,0,null,311,0,0,0,0,null,311,0,0,0,0,null,311,0,0,0,0]
[312,0,0,0,0,null,312,0,0,0,0,null,312,0,0,0,0,null,312,0,0,0,0,null,312,0,0,0,0,null,312,0,0,0,0,null,312,0,0,0,0,null,312,0,0,0,0,null,312,0,0,0,0,null,312,0,0,0,0,null,312,0,0,0,0,null,312,0,0,0,0]
[313,0,0,0,0,null,313,0,0,0,0,null,313,0,0,0,0,null,313,0,0,0,0,null,313,0,0,0,0,null,313,0,0,0,0,null,313,0,0,0,0,null,313,0,0,0,0,null,313,0,0,0,0,null,313,0,0,0,0,null,313,0,0,0,0,null,313,0,0,0,0]
[314,0,0,0,0,null,314,0,0,0,0,null,314,0,0,0,0,null,314,0,0,0,0,null,314,0,0,0,0,null,314,0,0,0,0,null,314,0,0,0,0,null,314,0,0,0,0,null,314,0,0,0,0,null,314,0,0,0,0,null,314,0,0,0,0,null,314,0,0,0,0]
[315,0,0,0,0,null,315,0,0,0,0,null,315,0,0,0,0,null,315,0,0,0,0,null,315,0,0,0,0,null,315,0,0,0,0,null,315,0,0,0,0,null,315,0,0,0,0,null,315,0,0,0,0,null,315,0,0,0,0,null,315,0,0,0,0,null,315,0,0,0,0]
[316,0,0,0,0,null,316,0,0,0,0,null,316,0,0,0,0,null,316,0,0,0,0,null,316,0,0,0,0,null,316,0,0,0,0,null,316,0,0,0,0,null,316,0,0,0,0,null,316,0,0,0,0,null,316,0,0,0,0,null,316,0,0,0,0,null,316,0,0,0,0]
[317,0,0,0,0,null,317,0,0,0,0,null,317,0,0,0,0,null,317,0,0,0,0,null,317,0,0,0,0,null,317,0,0,0,0,null,317,0,0,0,0,null,317,0,0,0,0,null,317,0,0,0,0,null,317,0,0,0,0,null,317,0,0,0,0,null,317,0,0,0,0]
[318,0,0,0,0,null,318,0,0,0,0,null,318,0,0,0,0,null,318,0,0,0,0,null,318,0,0,0,0,null,318,0,0,0,0,null,318,0,0,0,0,null,318,0,0,0,0,null,318,0,0,0,0,null,318,0,0,0,0,null,318,0,0,0,0,null,318,0,0,0,0]
[319,0,0,0,0,null,319,0,0,0,0,null,319,0,0,0,0,null,319,0,0,0,0,null,319,0,0,0,0,null,319,0,0,0,0,null,319,0,0,0,0,null,319,0,0,0,0,null,319,0,0,0,0,null,319,0,0,0,0,null,319,0,0,0,0,null,319,0,0,0,0]
[320,0,0,0,0,null,320,0,0,0,0,null,320,0,0,0,0,null,320,0,0,0,0,null,320,0,0,0,0,null,320,0,0,0,0,null,320,0,0,0,0,null,320,0,0,0,0,null,320,0,0,0,0,null,320,0,0,0,0,null,320,0,0,0,0,null,320,0,0,0,0]
[321,0,0,0,0,null,321,0,0,0,0,null,321,0,0,0,0,null,321,0,0,0,0,null,321,0,0,0,0,null,321,0,0,0,0,null,321,0,0,0,0,null,321,0,0,0,0,null,321,0,0,0,0,null,321,0,0,0,0,null,321,0,0,0,0,null,321,0,0,0,0]
[322,0,0,0,{"$f":"IF((B332+C332-D332)>0,B332+C332-D332,0)","v":0},null,322,0,0,0,{"$f":"IF((H332+I332-J332)>0,H332+I332-J332,0)","v":0},null,322,0,0,0,{"$f":"IF((N332+O332-P332)>0,N332+O332-P332,0)","v":0},null,322,0,{"$f":"T332*$V$6","v":0},0,{"$f":"IF((T332+U332-V332)>0,T332+U332-V332,0)","v":0},null,322,0,{"$f":"Z332*$AB$6","v":0},0,{"$f":"IF((Z332+AA332-AB332)>0,Z332+AA332-AB332,0)","v":0},null,322,0,{"$f":"AF332*$AH$6","v":0},0,{"$f":"IF((AF332+AG332-AH332)>0,AF332+AG332-AH332,0)","v":0},null,322,0,{"$f":"AL332*$AN$6","v":0},0,0,null,322,0,{"$f":"AR332*$AT$6","v":0},0,{"$f":"IF((AR332+AS332-AT332)>0,AR332+AS332-AT332,0)","v":0},null,322,0,{"$f":"AX332*$AZ$6","v":0},0,{"$f":"IF((AX332+AY332-AZ332)>0,AX332+AY332-AZ332,0)","v":0},null,322,0,{"$f":"BD332*$BF$6","v":0},0,{"$f":"IF((BD332+BE332-BF332)>0,BD332+BE332-BF332,0)","v":0},null,322,0,{"$f":"BJ332*$BL$6","v":0},0,{"$f":"IF((BJ332+BK332-BL332)>0,BJ332+BK332-BL332,0)","v":0},null,322,0,{"$f":"BP332*$BR$6","v":0},0,{"$f":"IF((BP332+BQ332-BR332)>0,BP332+BQ332-BR332,0)","v":0}]
[323,{"$f":"E332","v":0},{"$f":"B333*$D$6","v":0},{"$f":"IF((E332)>0,$D$7,0)","v":0},0,null,323,{"$f":"K332","v":0},{"$f":"H333*$J$6","v":0},{"$f":"IF((K332)>0,IF(E332=0,$J$7+$D$7,$J$7),0)","v":0},0,null,323,{"$f":"Q332","v":0},{"$f":"N333*$P$6","v":0},{"$f":"IF((Q332)>0,IF(K332=0,$P$7+$J$7+$D$7,$P$7),0)","v":0},0,null,323,{"$f":"W332","v":0},0,{"$f":"IF((W332)>0,IF(Q332=0,$P$7+$J$7+$D$7+$V$7,$V$7),0)","v":0},0,null,323,{"$f":"AC332","v":0},0,{"$f":"IF((AC332)>0,IF(W332=0,$AB$7+$V$7+$P$7+$J$7+$D$7,$AB$7),0)","v":0},0,null,323,{"$f":"AI332","v":0},0,{"$f":"IF((AI332)>0,IF(AC332=0,$AH$7+$AB$7+$V$7+$P$7+$J$7+$D$7,$AH$7),0)","v":0},0,null,323,{"$f":"AO332","v":0},0,{"$f":"IF((AO332)>0,IF(AI332=0,$AN$7+$AH$7+$AB$7+$V$7+$P$7+$J$7+$D$7,$AN$7),0)","v":0},{"$f":"IF((AL333+AM333-AN333)>0,AL333+AM333-AN333,0)","v":0},null,323,{"$f":"AU332","v":0},0,{"$f":"IF((AU332)>0,IF(AO332=0,$AT$7+$AN$7+$AH$7+$AB$7+$V$7+$P$7+$J$7+$D$7,$AT$7),0)","v":0},0,null,323,{"$f":"BA332","v":0},0,{"$f":"IF((BA332)>0,IF(AU332=0,$AZ$7+$AT$7+$AN$7+$AH$7+$AB$7+$V$7+$P$7+$J$7+$D$7,$AZ$7),0)","v":0},0,null,323,{"$f":"BG332","v":0},0,{"$f":"IF((BG332)>0,IF(BA332=0,$BF$7+$AZ$7+$AT$7+$AN$7+$AH$7+$AB$7+$V$7+$P$7+$J$7+$D$7,$BF$7),0)","v":0},0,null,323,{"$f":"BM332","v":0},0,{"$f":"IF((BM332)>0,IF(BG332=0,$BL$7+$BF$7+$AZ$7+$AT$7+$AN$7+$AH$7+$AB$7+$V$7+$P$7+$J$7+$D$7,$BL$7),0)","v":0},0,null,323,{"$f":"BS332","v":0},0,{"$f":"IF((BS332)>0,IF(BM332=0,$BR$7+$BL$7+$BF$7+$AZ$7+$AT$7+$AN$7+$AH$7+$AB$7+$V$7+$P$7+$J$7+$D$7,$BR$7),0)","v":0},0]
[324,0,0,0,0,null,324,0,0,0,0,null,324,0,0,0,0,null,324,0,0,0,0,null,324,0,0,0,0,null,324,0,0,0,0,null,324,0,0,0,0,null,324,0,0,0,0,null,324,0,0,0,0,null,324,0,0,0,0,null,324,0,0,0,0,null,324,0,0,0,0]
[325,0,0,0,0,null,325,0,0,0,0,null,325,0,0,0,0,null,325,0,0,0,0,null,325,0,0,0,0,null,325,0,0,0,0,null,325,0,0,0,0,null,325,0,0,0,0,null,325,0,0,0,0,null,325,0,0,0,0,null,325,0,0,0,0,null,325,0,0,0,0]
[326,0,0,0,0,null,326,0,0,0,0,null,326,0,0,0,0,null,326,0,0,0,0,null,326,0,0,0,0,null,326,0,0,0,0,null,326,0,0,0,0,null,326,0,0,0,0,null,326,0,0,0,0,null,326,0,0,0,0,null,326,0,0,0,0,null,326,0,0,0,0]
[327,0,0,0,0,null,327,0,0,0,0,null,327,0,0,0,0,null,327,0,0,0,0,null,327,0,0,0,0,null,327,0,0,0,0,null,327,0,0,0,0,null,327,0,0,0,0,null,327,0,0,0,0,null,327,0,0,0,0,null,327,0,0,0,0,null,327,0,0,0,0]
[328,0,0,0,0,null,328,0,0,0,0,null,328,0,0,0,0,null,328,0,0,0,0,null,328,0,0,0,0,null,328,0,0,0,0,null,328,0,0,0,0,null,328,0,0,0,0,null,328,0,0,0,0,null,328,0,0,0,0,null,328,0,0,0,0,null,328,0,0,0,0]
[329,0,0,0,0,null,329,0,0,0,0,null,329,0,0,0,0,null,329,0,0,0,0,null,329,0,0,0,0,null,329,0,0,0,0,null,329,0,0,0,0,null,329,0,0,0,0,null,329,0,0,0,0,null,329,0,0,0,0,null,329,0,0,0,0,null,329,0,0,0,0]
[330,0,0,0,0,null,330,0,0,0,0,null,330,0,0,0,0,null,330,0,0,0,0,null,330,0,0,0,0,null,330,0,0,0,0,null,330,0,0,0,0,null,330,0,0,0,0,null,330,0,0,0,0,null,330,0,0,0,0,null,330,0,0,0,0,null,330,0,0,0,0]
[331,0,0,0,0,null,331,0,0,0,0,null,331,0,0,0,0,null,331,0,0,0,0,null,331,0,0,0,0,null,331,0,0,0,0,null,331,0,0,0,0,null,331,0,0,0,0,null,331,0,0,0,0,null,331,0,0,0,0,null,331,0,0,0,0,null,331,0,0,0,0]
[332,0,0,0,0,null,332,0,0,0,0,null,332,0,0,0,0,null,332,0,0,0,0,null,332,0,0,0,0,null,332,0,0,0,0,null,332,0,0,0,0,null,332,0,0,0,0,null,332,0,0,0,0,null,332,0,0,0,0,null,332,0,0,0,0,null,332,0,0,0,0]
[333,0,0,0,0,null,333,0,0,0,0,null,333,0,0,0,0,null,333,0,0,0,0,null,333,0,0,0,0,null,333,0,0,0,0,null,333,0,0,0,0,null,333,0,0,0,0,null,333,0,0,0,0,null,333,0,0,0,0,null,333,0,0,0,0,null,333,0,0,0,0]
[334,0,0,0,0,null,334,0,0,0,0,null,334,0,0,0,0,null,334,0,0,0,0,null,334,0,0,0,0,null,334,0,0,0,0,null,334,0,0,0,0,null,334,0,0,0,0,null,334,0,0,0,0,null,334,0,0,0,0,null,334,0,0,0,0,null,334,0,0,0,0]
[335,0,0,0,0,null,335,0,0,0,0,null,335,0,0,0,0,null,335,0,0,0,0,null,335,0,0,0,0,null,335,0,0,0,0,null,335,0,0,0,0,null,335,0,0,0,0,null,335,0,0,0,0,null,335,0,0,0,0,null,335,0,0,0,0,null,335,0,0,0,0]
[336,0,0,0,0,null,336,0,0,0,0,null,336,0,0,0,0,null,336,0,0,0,0,null,336,0,0,0,0,null,336,0,0,0,0,null,336,0,0,0,0,null,336,0,0,0,0,null,336,0,0,0,0,null,336,0,0,0,0,null,336,0,0,0,0,null,336,0,0,0,0]
[337,0,0,0,0,null,337,0,0,0,0,null,337,0,0,0,0,null,337,0,0,0,0,null,337,0,0,0,0,null,337,0,0,0,0,null,337,0,0,0,0,null,337,0,0,0,0,null,337,0,0,0,0,null,337,0,0,0,0,null,337,0,0,0,0,null,337,0,0,0,0]
[338,0,0,0,0,null,338,0,0,0,0,null,338,0,0,0,0,null,338,0,0,0,0,null,338,0,0,0,0,null,338,0,0,0,0,null,338,0,0,0,0,null,338,0,0,0,0,null,338,0,0,0,0,null,338,0,0,0,0,null,338,0,0,0,0,null,338,0,0,0,0]
[339,0,0,0,0,null,339,0,0,0,0,null,339,0,0,0,0,null,339,0,0,0,0,null,339,0,0,0,0,null,339,0,0,0,0,null,339,0,0,0,0,null,339,0,0,0,0,null,339,0,0,0,0,null,339,0,0,0,0,null,339,0,0,0,0,null,339,0,0,0,0]
[340,0,0,0,0,null,340,0,0,0,0,null,340,0,0,0,0,null,340,0,0,0,0,null,340,0,0,0,0,null,340,0,0,0,0,null,340,0,0,0,0,null,340,0,0,0,0,null,340,0,0,0,0,null,340,0,0,0,0,null,340,0,0,0,0,null,340,0,0,0,0]
[341,0,0,0,0,null,341,0,0,0,0,null,341,0,0,0,0,null,341,0,0,0,0,null,341,0,0,0,0,null,341,0,0,0,0,null,341,0,0,0,0,null,341,0,0,0,0,null,341,0,0,0,0,null,341,0,0,0,0,null,341,0,0,0,0,null,341,0,0,0,0]
[342,0,0,0,0,null,342,0,0,0,0,null,342,0,0,0,0,null,342,0,0,0,0,null,342,0,0,0,0,null,342,0,0,0,0,null,342,0,0,0,0,null,342,0,0,0,0,null,342,0,0,0,0,null,342,0,0,0,0,null,342,0,0,0,0,null,342,0,0,0,0]
[343,0,0,0,0,null,343,0,0,0,0,null,343,0,0,0,0,null,343,0,0,0,0,null,343,0,0,0,0,null,343,0,0,0,0,null,343,0,0,0,0,null,343,0,0,0,0,null,343,0,0,0,0,null,343,0,0,0,0,null,343,0,0,0,0,null,343,0,0,0,0]
[344,0,0,0,0,null,344,0,0,0,0,null,344,0,0,0,0,null,344,0,0,0,0,null,344,0,0,0,0,null,344,0,0,0,0,null,344,0,0,0,0,null,344,0,0,0,0,null,344,0,0,0,0,null,344,0,0,0,0,null,344,0,0,0,0,null,344,0,0,0,0]
[345,0,0,0,0,null,345,0,0,0,0,null,345,0,0,0,0,null,345,0,0,0,0,null,345,0,0,0,0,null,345,0,0,0,0,null,345,0,0,0,0,null,345,0,0,0,0,null,345,0,0,0,0,null,345,0,0,0,0,null,345,0,0,0,0,null,345,0,0,0,0]
[346,0,0,0,0,null,346,0,0,0,0,null,346,0,0,0,0,null,346,0,0,0,0,null,346,0,0,0,0,null,346,0,0,0,0,null,346,0,0,0,0,null,346,0,0,0,0,null,346,0,0,0,0,null,346,0,0,0,0,null,346,0,0,0,0,null,346,0,0,0,0]
[347,0,0,0,0,null,347,0,0,0,0,null,347,0,0,0,0,null,347,0,0,0,0,null,347,0,0,0,0,null,347,0,0,0,0,null,347,0,0,0,0,null,347,0,0,0,0,null,347,0,0,0,0,null,347,0,0,0,0,null,347,0,0,0,0,null,347,0,0,0,0]
[348,0,0,0,0,null,348,0,0,0,0,null,348,0,0,0,0,null,348,0,0,0,0,null,348,0,0,0,0,null,348,0,0,0,0,null,348,0,0,0,0,null,348,0,0,0,0,null,348,0,0,0,0,null,348,0,0,0,0,null,348,0,0,0,0,null,348,0,0,0,0]
[349,0,0,0,0,null,349,0,0,0,0,null,349,0,0,0,0,null,349,0,0,0,0,null,349,0,0,0,0,null,349,0,0,0,0,null,349,0,0,0,0,null,349,0,0,0,0,null,349,0,0,0,0,null,349,0,0,0,0,null,349,0,0,0,0,null,349,0,0,0,0]
[350,0,0,0,0,null,350,0,0,0,0,null,350,0,0,0,0,null,350,0,0,0,0,null,350,0,0,0,0,null,350,0,0,0,0,null,350,0,0,0,0,null,350,0,0,0,0,null,350,0,0,0,0,null,350,0,0,0,0,null,350,0,0,0,0,null,350,0,0,0,0]
[351,0,0,0,0,null,351,0,0,0,0,null,351,0,0,0,0,null,351,0,0,0,0,null,351,0,0,0,0,null,351,0,0,0,0,null,351,0,0,0,0,null,351,0,0,0,0,null,351,0,0,0,0,null,351,0,0,0,0,null,351,0,0,0,0,null,351,0,0,0,0]
[352,0,0,0,0,null,352,0,0,0,0,null,352,0,0,0,0,null,352,0,0,0,0,null,352,0,0,0,0,null,352,0,0,0,0,null,352,0,0,0,0,null,352,0,0,0,0,null,352,0,0,0,0,null,352,0,0,0,0,null,352,0,0,0,0,null,352,0,0,0,0]
[353,0,0,0,0,null,353,0,0,0,0,null,353,0,0,0,0,null,353,0,0,0,0,null,353,0,0,0,0,null,353,0,0,0,0,null,353,0,0,0,0,null,353,0,0,0,0,null,353,0,0,0,0,null,353,0,0,0,0,null,353,0,0,0,0,null,353,0,0,0,0]
[354,0,0,0,0,null,354,0,0,0,0,null,354,0,0,0,0,null,354,0,0,0,0,null,354,0,0,0,0,null,354,0,0,0,0,null,354,0,0,0,0,null,354,0,0,0,0,null,354,0,0,0,0,null,354,0,0,0,0,null,354,0,0,0,0,null,354,0,0,0,0]
[355,0,0,0,0,null,355,0,0,0,0,null,355,0,0,0,0,null,355,0,0,0,0,null,355,0,0,0,0,null,355,0,0,0,0,null,355,0,0,0,0,null,355,0,0,0,0,null,355,0,0,0,0,null,355,0,0,0,0,null,355,0,0,0,0,null,355,0,0,0,0]
[356,0,0,0,0,null,356,0,0,0,0,null,356,0,0,0,0,null,356,0,0,0,0,null,356,0,0,0,0,null,356,0,0,0,0,null,356,0,0,0,0,null,356,0,0,0,0,null,356,0,0,0,0,null,356,0,0,0,0,null,356,0,0,0,0,null,356,0,0,0,0]
[357,0,0,0,0,null,357,0,0,0,0,null,357,0,0,0,0,null,357,0,0,0,0,null,357,0,0,0,0,null,357,0,0,0,0,null,357,0,0,0,0,null,357,0,0,0,0,null,357,0,0,0,0,null,357,0,0,0,0,null,357,0,0,0,0,null,357,0,0,0,0]
[358,0,0,0,0,null,358,0,0,0,0,null,358,0,0,0,0,null,358,0,0,0,0,null,358,0,0,0,0,null,358,0,0,0,0,null,358,0,0,0,0,null,358,0,0,0,0,null,358,0,0,0,0,null,358,0,0,0,0,null,358,0,0,0,0,null,358,0,0,0,0]
[359,0,0,0,0,null,359,0,0,0,0,null,359,0,0,0,0,null,359,0,0,0,0,null,359,0,0,0,0,null,359,0,0,0,0,null,359,0,0,0,0,null,359,0,0,0,0,null,359,0,0,0,0,null,359,0,0,0,0,null,359,0,0,0,0,null,359,0,0,0,0]
[360,0,0,0,0,null,360,0,0,0,0,null,360,0,0,0,0,null,360,0,0,0,0,null,360,0,0,0,0,null,360,0,0,0,0,null,360,0,0,0,0,null,360,0,0,0,0,null,360,0,0,0,0,null,360,0,0,0,0,null,360,0,0,0,0,null,360,0,0,0,0]
[]
["TOTAL",null,{"$f":"SUM(C11:C130)","v":0},{"$f":"SUM(D11:D130)","v":0},null,null,"TOTAL",null,{"$f":"SUM(I11:I130)","v":0},{"$f":"SUM(J11:J130)","v":0},null,null,"TOTAL",null,{"$f":"SUM(O11:O130)","v":0},{"$f":"SUM(P11:P130)","v":0},null,null,"TOTAL",null,{"$f":"SUM(U11:U130)","v":0},{"$f":"SUM(V11:V130)","v":0},null,null,"TOTAL",null,{"$f":"SUM(AA11:AA130)","v":0},{"$f":"SUM(AB11:AB130)","v":0},null,null,"TOTAL",null,{"$f":"SUM(AG11:AG130)","v":0},{"$f":"SUM(AH11:AH130)","v":0},null,null,"TOTAL",null,{"$f":"SUM(AM11:AM130)","v":0},{"$f":"SUM(AN11:AN130)","v":0},null,null,"TOTAL",null,{"$f":"SUM(AS11:AS130)","v":0},{"$f":"SUM(AT11:AT130)","v":0},null,null,"TOTAL",null,{"$f":"SUM(AY11:AY130)","v":0},{"$f":"SUM(AZ11:AZ130)","v":0},null,null,"TOTAL",null,{"$f":"SUM(BE11:BE130)","v":0},{"$f":"SUM(BF11:BF130)","v":0},null,null,"TOTAL",null,{"$f":"SUM(BK11:BK130)","v":0},{"$f":"SUM(BL11:BL130)","v":0},null,null,"TOTAL",null,{"$f":"SUM(BQ11:BQ130)","v":0},{"$f":"SUM(BR11:BR130)","v":0}]

{"sheet":"Debt Page","index":29,"n_rows":28,"n_cols":7,"rows_kept":28,"cut":false,"hidden":true,"merged":[]}
[]
[]
[]
[]
[]
[]
[]
[null,"Debt Name","Balance","Interest Rate","Minimum Payment","Time to pay off (months)","Interest Paid"]
[1,null,null,null,null,{"$f":"IFERROR(NPER(D9/12,-E9,C9,,0),\"\")","v":""},{"$f":"IF(B9=0,0,HLOOKUP(B9,'Debt Liquidation Sched'!$A$4:$BQ$372,369,FALSE))","v":0}]
[2,null,null,null,null,"",{"$f":"IF(B10=0,0,HLOOKUP(B10,'Debt Liquidation Sched'!$A$4:$BQ$372,369,FALSE))","v":0}]
[3,null,null,null,null,"",{"$f":"IF(B11=0,0,HLOOKUP(B11,'Debt Liquidation Sched'!$A$4:$BQ$372,369,FALSE))","v":0}]
[4,null,null,null,null,"",{"$f":"IF(B12=0,0,HLOOKUP(B12,'Debt Liquidation Sched'!$A$4:$BQ$372,369,FALSE))","v":0}]
[5,null,null,null,null,"",{"$f":"IF(B13=0,0,HLOOKUP(B13,'Debt Liquidation Sched'!$A$4:$BQ$372,369,FALSE))","v":0}]
[6,null,null,null,null,"",{"$f":"IF(B14=0,0,HLOOKUP(B14,'Debt Liquidation Sched'!$A$4:$BQ$372,369,FALSE))","v":0}]
[7,null,null,null,null,"",{"$f":"IF(B15=0,0,HLOOKUP(B15,'Debt Liquidation Sched'!$A$4:$BQ$372,369,FALSE))","v":0}]
[8,null,null,null,null,"",{"$f":"IF(B16=0,0,HLOOKUP(B16,'Debt Liquidation Sched'!$A$4:$BQ$372,369,FALSE))","v":0}]
[9,null,null,null,null,"",{"$f":"IF(B17=0,0,HLOOKUP(B17,'Debt Liquidation Sched'!$A$4:$BQ$372,369,FALSE))","v":0}]
[10,null,null,null,null,null,{"$f":"IF(B18=0,0,HLOOKUP(B18,'Debt Liquidation Sched'!$A$4:$BQ$372,369,FALSE))","v":0}]
[11,null,null,null,null,null,{"$f":"IF(B19=0,0,HLOOKUP(B19,'Debt Liquidation Sched'!$A$4:$BQ$372,369,FALSE))","v":0}]
[12,null,null,null,null,null,{"$f":"IF(B20=0,0,HLOOKUP(B20,'Debt Liquidation Sched'!$A$4:$BQ$372,369,FALSE))","v":0}]
[]
[null,"Total Balance",{"$f":"SUM(C9:C20)","v":0}]
[null,"Total Interest Paid",{"$f":"SUM(G9:G20)","v":0}]
[null,"Total Paid",{"$f":"SUM(C22:C23)","v":0}]
[]
[]
[null,"Total Paid Each Month",{"$f":"SUM(E9:E20)","v":0}]
[null,"Number of Months Until Paid",{"$f":"MAX(MATCH(0,'Debt Liquidation Sched'!E11:E370,0),MATCH(0,'Debt Liquidation Sched'!K11:K370,0),MATCH(0,'Debt Liquidation Sched'!Q11:Q370,0),MATCH(0,'Debt Liquidation Sched'!W11:W370,0),MATCH(0,'Debt Liquidation Sched'!AC11:AC370,0),MATCH(0,'Debt Liquidation Sched'!AI11:AI370,0),MATCH(0,'Debt Liquidation Sched'!AO11:AO370,0),MATCH(0,'Debt Liquidation Sched'!AU11:AU370,0),MATCH(0,'Debt Liquidation Sched'!BA11:BA370,0),MATCH(0,'Debt Liquidation Sched'!BG11:BG370,0),MATCH(0,'Debt Liquidation Sched'!BM11:BM370,0),MATCH(0,'Debt Liquidation Sched'!BS11:BS370,0))","v":1},{"$f":"CONCATENATE(TRUNC(C28/12), \" Years, \",ROUNDUP(C28-TRUNC(C28/12)*12,0),\" Months\")","v":"0 Years, 1 Months"}]

{"sheet":"Drop Downs","index":30,"n_rows":40,"n_cols":2,"rows_kept":40,"cut":false,"hidden":true,"merged":[]}
["Yes/No"]
[1,"Yes"]
[2,"No"]
[]
["SS Age"]
[1,62]
[2,67]
[3,70]
[]
["Marital Status"]
[1,"Married"]
[2,"Single"]
[]
["Account Types"]
[1,"401(k)"]
[2,"403(b)"]
[3,"JTWROS"]
[4,"Individual"]
[5,"Trust"]
[6,"Trad IRA"]
[7,"Roth IRA"]
[8,"Trad IRAB"]
[9,"OPERS"]
[10,"Def Comp 457"]
[11,"Roth 401(k)"]
[12,"Roth 403(b)"]
[13,"SIMPLE IRA"]
[14,"SEP IRA"]
[15,"Other"]
[]
["Names"]
[1,0]
[2,0]
[3,"JT / Ind"]
[]
["Debt Types"]
[1,"Education Loan"]
[2,"Auto Loan"]
[3,"Credit Card"]
[4,"Other"]

{"sheet":"Retirement Scenario","index":31,"n_rows":153,"n_cols":13,"rows_kept":153,"cut":false,"hidden":true,"merged":[[57,2,57,8],[59,2,60,3],[61,2,63,3],[12,2,12,8],[12,11,12,12],[23,2,23,8],[34,2,34,6],[40,2,40,5],[46,2,46,7]]}
[]
[null,"Basic Information"]
[]
[]
[null,null,"Name",null,"DOB","Current Age","Ret. Age","S.S. Start Age","Pension?","Pension Start Age",null,"Today's Date","2020-03-26"]
[null,null,null,null,null,{"$f":"'Retirement Calculations'!F87","v":""}]
[null,null,null,null,null,{"$f":"'Retirement Calculations'!F88","v":""},null,null,null,null,null,"Marital Status","Single"]
[]
[]
[null,"Retirement Assets"]
[]
[]
[null,null,{"$f":"CONCATENATE($C$6,\"'s Invested Assets Available Upon Retirement\")","v":"'s Invested Assets Available Upon Retirement"},null,null,null,null,null,null,null,null,"Age at Negative Balance"]
[null,null,"Account Type","Detail","Balance","Contributions","Periods/Year","Yearly Total Cont.","Order of Use",null,null,{"$f":"IF(C6=0,\" \",C6)","v":" "},{"$f":"IF(C7=0,\" \",C7)","v":" "}]
[null,null,null,null,null,null,null,{"$f":"'Retirement Calculations'!H92","v":""},null,null,null,{"$f":"INDEX($B$71:$L$141, MATCH(0,$L$71:$L$141,0),1)","v":{"$error":"#N/A"}},{"$f":"INDEX($B$71:$L$141, MATCH(0,$L$71:$L$141,0),3)","v":{"$error":"#N/A"}}]
[null,null,null,null,null,null,null,{"$f":"'Retirement Calculations'!H93","v":""}]
[null,null,null,null,null,null,null,{"$f":"'Retirement Calculations'!H94","v":""}]
[null,null,null,null,null,null,null,{"$f":"'Retirement Calculations'!H95","v":""}]
[null,null,null,null,null,null,null,{"$f":"'Retirement Calculations'!H96","v":""}]
[null,null,null,null,null,null,null,{"$f":"'Retirement Calculations'!H97","v":""}]
[null,null,null,null,{"$f":"'Retirement Calculations'!E98","v":0},{"$f":"'Retirement Calculations'!F98","v":0},null,{"$f":"'Retirement Calculations'!H98","v":0}]
[]
[]
[null,null,{"$f":"CONCATENATE($C$7,\"'s Invested Assets Available Upon Retirement\")","v":"'s Invested Assets Available Upon Retirement"}]
[null,null,"Account Type","Detail","Balance","Contributions","Periods/Year","Yearly Total Cont.","Order of Use"]
[null,null,null,null,null,null,null,{"$f":"'Retirement Calculations'!H102","v":""}]
[null,null,null,null,null,null,null,{"$f":"'Retirement Calculations'!H103","v":""}]
[null,null,null,null,null,null,null,{"$f":"'Retirement Calculations'!H104","v":""}]
[null,null,null,null,null,null,null,{"$f":"'Retirement Calculations'!H105","v":""}]
[null,null,null,null,null,null,null,{"$f":"'Retirement Calculations'!H106","v":""}]
[null,null,null,null,null,null,null,{"$f":"'Retirement Calculations'!H107","v":""},null,"Total"]
[null,null,null,null,{"$f":"'Retirement Calculations'!E108","v":0},{"$f":"'Retirement Calculations'!F108","v":0},null,{"$f":"'Retirement Calculations'!H108","v":0},null,{"$f":"'Retirement Calculations'!J108","v":0}]
[]
[]
[null,null,"Social Security Benefits",null,null,null,null,null,"Annual Rate Assumptions"]
[null,null,null,62,67,70,"Year Total",null,"Inflation Rate",0.03]
[null,null,{"$f":"IF(C6>0,C6,\"\")","v":""},null,null,null,{"$f":"'Retirement Calculations'!J112","v":0},null,"COLA",{"$f":"J36-0.005","v":2.4999999999999998E-2}]
[null,null,{"$f":"IF(C7>0,C7,\"\")","v":""},null,null,null,{"$f":"'Retirement Calculations'!J113","v":""},null,"Pre-Retirement ROR",0.06]
[null,null,null,null,null,null,null,null,"Post-Retirement ROR",0.04]
[null,null,null,null,null,null,null,null,"Ret. Eff. Tax Rate",0.12]
[null,null,"Pension Benefits"]
[null,null,null,"Monthly","Yearly","Inf. Adjusted?"]
[null,null,{"$f":"IF(I6=\"Yes\",C6,\"\")","v":""},null,{"$f":"'Retirement Calculations'!H116","v":""},0]
[null,null,{"$f":"IF(I7=\"Yes\",C7,\"\")","v":""},null,{"$f":"'Retirement Calculations'!H117","v":""},0]
[]
[]
[null,null,"Income Sources (Projected)"]
[null,null,null,"Monthly","Yearly","Term (yrs)","Beginning Year","End Year"]
[null,null,"Earned income",null,{"$f":"'Retirement Calculations'!F120","v":""},null,null,{"$f":"'Retirement Calculations'!I120","v":""}]
[null,null,"Rental income",null,{"$f":"'Retirement Calculations'!F121","v":""},null,null,{"$f":"'Retirement Calculations'!I121","v":""}]
[null,null,"Sale of major asset",null,{"$f":"'Retirement Calculations'!F122","v":""},null,null,{"$f":"'Retirement Calculations'!I122","v":""}]
[null,null,"Other income",null,{"$f":"'Retirement Calculations'!F123","v":""},null,null,{"$f":"'Retirement Calculations'!I123","v":""}]
[]
[]
[null,"Monthly Needs"]
[]
[]
[null,null,"Monthly Income Need"]
[null,null,null,null,"Monthly","Yearly","Period (yrs)","Beginning Year","End Year"]
[null,null,"How much income is needed in retirement monthly? ",null,null,{"$f":"'Retirement Calculations'!F126","v":""},null,{"$f":"'Retirement Calculations'!H126","v":2020},{"$f":"'Retirement Calculations'!I126","v":""}]
[null,null,null,null,null,{"$f":"'Retirement Calculations'!F127","v":""},null,{"$f":"'Retirement Calculations'!H127","v":""},{"$f":"'Retirement Calculations'!I127","v":""}]
[null,null,"If the need changes over time, fill out multiple periods.",null,null,{"$f":"'Retirement Calculations'!F128","v":""},null,{"$f":"'Retirement Calculations'!H128","v":""},{"$f":"'Retirement Calculations'!I128","v":""}]
[null,"Yes",null,null,null,{"$f":"'Retirement Calculations'!F129","v":""},null,{"$f":"'Retirement Calculations'!H129","v":""},{"$f":"'Retirement Calculations'!I129","v":""}]
[null,"No",null,null,null,{"$f":"'Retirement Calculations'!F130","v":""},null,{"$f":"'Retirement Calculations'!H130","v":""},{"$f":"'Retirement Calculations'!I130","v":""}]
[]
[]
[null,"Details"]
[]
[]
[null,{"$f":"CONCATENATE($C$6,\"'s \",\"Age\")","v":"'s Age"},"Year",{"$f":"CONCATENATE($C$7,\"'s \",\"Age\")","v":"'s Age"},"SS Benefits","Pension","Income Sources","Total Income","Monthly Need","Retirement Account Balance","Monthly Amount Still Needed","Remaining Balance"]
[null,{"$f":"'Retirement Calculations'!B136","v":""},{"$f":"'Retirement Calculations'!A136","v":2020},{"$f":"'Retirement Calculations'!C136","v":""},{"$f":"'Retirement Calculations'!F136","v":0},{"$f":"'Retirement Calculations'!I136","v":0},{"$f":"'Retirement Calculations'!N136","v":0},{"$f":"'Retirement Calculations'!O136","v":0},{"$f":"'Retirement Calculations'!P136","v":{"$error":"#VALUE!"}},{"$f":"'Retirement Calculations'!T136","v":{"$error":"#N/A"}},{"$f":"'Retirement Calculations'!Q136","v":{"$error":"#VALUE!"}},{"$f":"'Retirement Calculations'!W136","v":{"$error":"#VALUE!"}}]
[null,{"$f":"'Retirement Calculations'!B137","v":{"$error":"#VALUE!"}},{"$f":"'Retirement Calculations'!A137","v":2021},{"$f":"'Retirement Calculations'!C137","v":""},{"$f":"'Retirement Calculations'!F137","v":{"$error":"#VALUE!"}},{"$f":"'Retirement Calculations'!I137","v":{"$error":"#VALUE!"}},{"$f":"'Retirement Calculations'!N137","v":0},{"$f":"'Retirement Calculations'!O137","v":{"$error":"#VALUE!"}},{"$f":"'Retirement Calculations'!P137","v":{"$error":"#VALUE!"}},{"$f":"'Retirement Calculations'!T137","v":{"$error":"#VALUE!"}},{"$f":"'Retirement Calculations'!Q137","v":{"$error":"#VALUE!"}},{"$f":"'Retirement Calculations'!W137","v":{"$error":"#VALUE!"}}]
[null,{"$f":"'Retirement Calculations'!B138","v":{"$error":"#VALUE!"}},{"$f":"'Retirement Calculations'!A138","v":2022},{"$f":"'Retirement Calculations'!C138","v":""},{"$f":"'Retirement Calculations'!F138","v":{"$error":"#VALUE!"}},{"$f":"'Retirement Calculations'!I138","v":{"$error":"#VALUE!"}},{"$f":"'Retirement Calculations'!N138","v":0},{"$f":"'Retirement Calculations'!O138","v":{"$error":"#VALUE!"}},{"$f":"'Retirement Calculations'!P138","v":{"$error":"#VALUE!"}},{"$f":"'Retirement Calculations'!T138","v":{"$error":"#VALUE!"}},{"$f":"'Retirement Calculations'!Q138","v":{"$error":"#VALUE!"}},{"$f":"'Retirement Calculations'!W138","v":{"$error":"#VALUE!"}}]
[null,{"$f":"'Retirement Calculations'!B139","v":{"$error":"#VALUE!"}},{"$f":"'Retirement Calculations'!A139","v":2023},{"$f":"'Retirement Calculations'!C139","v":""},{"$f":"'Retirement Calculations'!F139","v":{"$error":"#VALUE!"}},{"$f":"'Retirement Calculations'!I139","v":{"$error":"#VALUE!"}},{"$f":"'Retirement Calculations'!N139","v":0},{"$f":"'Retirement Calculations'!O139","v":{"$error":"#VALUE!"}},{"$f":"'Retirement Calculations'!P139","v":{"$error":"#VALUE!"}},{"$f":"'Retirement Calculations'!T139","v":{"$error":"#VALUE!"}},{"$f":"'Retirement Calculations'!Q139","v":{"$error":"#VALUE!"}},{"$f":"'Retirement Calculations'!W139","v":{"$error":"#VALUE!"}}]
[null,{"$f":"'Retirement Calculations'!B140","v":{"$error":"#VALUE!"}},{"$f":"'Retirement Calculations'!A140","v":2024},{"$f":"'Retirement Calculations'!C140","v":""},{"$f":"'Retirement Calculations'!F140","v":{"$error":"#VALUE!"}},{"$f":"'Retirement Calculations'!I140","v":{"$error":"#VALUE!"}},{"$f":"'Retirement Calculations'!N140","v":0},{"$f":"'Retirement Calculations'!O140","v":{"$error":"#VALUE!"}},{"$f":"'Retirement Calculations'!P140","v":{"$error":"#VALUE!"}},{"$f":"'Retirement Calculations'!T140","v":{"$error":"#VALUE!"}},{"$f":"'Retirement Calculations'!Q140","v":{"$error":"#VALUE!"}},{"$f":"'Retirement Calculations'!W140","v":{"$error":"#VALUE!"}}]
[null,{"$f":"'Retirement Calculations'!B141","v":{"$error":"#VALUE!"}},{"$f":"'Retirement Calculations'!A141","v":2025},{"$f":"'Retirement Calculations'!C141","v":""},{"$f":"'Retirement Calculations'!F141","v":{"$error":"#VALUE!"}},{"$f":"'Retirement Calculations'!I141","v":{"$error":"#VALUE!"}},{"$f":"'Retirement Calculations'!N141","v":0},{"$f":"'Retirement Calculations'!O141","v":{"$error":"#VALUE!"}},{"$f":"'Retirement Calculations'!P141","v":{"$error":"#VALUE!"}},{"$f":"'Retirement Calculations'!T141","v":{"$error":"#VALUE!"}},{"$f":"'Retirement Calculations'!Q141","v":{"$error":"#VALUE!"}},{"$f":"'Retirement Calculations'!W141","v":{"$error":"#VALUE!"}}]
[null,{"$f":"'Retirement Calculations'!B142","v":{"$error":"#VALUE!"}},{"$f":"'Retirement Calculations'!A142","v":2026},{"$f":"'Retirement Calculations'!C142","v":""},{"$f":"'Retirement Calculations'!F142","v":{"$error":"#VALUE!"}},{"$f":"'Retirement Calculations'!I142","v":{"$error":"#VALUE!"}},{"$f":"'Retirement Calculations'!N142","v":0},{"$f":"'Retirement Calculations'!O142","v":{"$error":"#VALUE!"}},{"$f":"'Retirement Calculations'!P142","v":{"$error":"#VALUE!"}},{"$f":"'Retirement Calculations'!T142","v":{"$error":"#VALUE!"}},{"$f":"'Retirement Calculations'!Q142","v":{"$error":"#VALUE!"}},{"$f":"'Retirement Calculations'!W142","v":{"$error":"#VALUE!"}}]
[null,{"$f":"'Retirement Calculations'!B143","v":{"$error":"#VALUE!"}},{"$f":"'Retirement Calculations'!A143","v":2027},{"$f":"'Retirement Calculations'!C143","v":""},{"$f":"'Retirement Calculations'!F143","v":{"$error":"#VALUE!"}},{"$f":"'Retirement Calculations'!I143","v":{"$error":"#VALUE!"}},{"$f":"'Retirement Calculations'!N143","v":0},{"$f":"'Retirement Calculations'!O143","v":{"$error":"#VALUE!"}},{"$f":"'Retirement Calculations'!P143","v":{"$error":"#VALUE!"}},{"$f":"'Retirement Calculations'!T143","v":{"$error":"#VALUE!"}},{"$f":"'Retirement Calculations'!Q143","v":{"$error":"#VALUE!"}},{"$f":"'Retirement Calculations'!W143","v":{"$error":"#VALUE!"}}]
[null,{"$f":"'Retirement Calculations'!B144","v":{"$error":"#VALUE!"}},{"$f":"'Retirement Calculations'!A144","v":2028},{"$f":"'Retirement Calculations'!C144","v":""},{"$f":"'Retirement Calculations'!F144","v":{"$error":"#VALUE!"}},{"$f":"'Retirement Calculations'!I144","v":{"$error":"#VALUE!"}},{"$f":"'Retirement Calculations'!N144","v":0},{"$f":"'Retirement Calculations'!O144","v":{"$error":"#VALUE!"}},{"$f":"'Retirement Calculations'!P144","v":{"$error":"#VALUE!"}},{"$f":"'Retirement Calculations'!T144","v":{"$error":"#VALUE!"}},{"$f":"'Retirement Calculations'!Q144","v":{"$error":"#VALUE!"}},{"$f":"'Retirement Calculations'!W144","v":{"$error":"#VALUE!"}}]
[null,{"$f":"'Retirement Calculations'!B145","v":{"$error":"#VALUE!"}},{"$f":"'Retirement Calculations'!A145","v":2029},{"$f":"'Retirement Calculations'!C145","v":""},{"$f":"'Retirement Calculations'!F145","v":{"$error":"#VALUE!"}},{"$f":"'Retirement Calculations'!I145","v":{"$error":"#VALUE!"}},{"$f":"'Retirement Calculations'!N145","v":0},{"$f":"'Retirement Calculations'!O145","v":{"$error":"#VALUE!"}},{"$f":"'Retirement Calculations'!P145","v":{"$error":"#VALUE!"}},{"$f":"'Retirement Calculations'!T145","v":{"$error":"#VALUE!"}},{"$f":"'Retirement Calculations'!Q145","v":{"$error":"#VALUE!"}},{"$f":"'Retirement Calculations'!W145","v":{"$error":"#VALUE!"}}]
[null,{"$f":"'Retirement Calculations'!B146","v":{"$error":"#VALUE!"}},{"$f":"'Retirement Calculations'!A146","v":2030},{"$f":"'Retirement Calculations'!C146","v":""},{"$f":"'Retirement Calculations'!F146","v":{"$error":"#VALUE!"}},{"$f":"'Retirement Calculations'!I146","v":{"$error":"#VALUE!"}},{"$f":"'Retirement Calculations'!N146","v":0},{"$f":"'Retirement Calculations'!O146","v":{"$error":"#VALUE!"}},{"$f":"'Retirement Calculations'!P146","v":{"$error":"#VALUE!"}},{"$f":"'Retirement Calculations'!T146","v":{"$error":"#VALUE!"}},{"$f":"'Retirement Calculations'!Q146","v":{"$error":"#VALUE!"}},{"$f":"'Retirement Calculations'!W146","v":{"$error":"#VALUE!"}}]
[null,{"$f":"'Retirement Calculations'!B147","v":{"$error":"#VALUE!"}},{"$f":"'Retirement Calculations'!A147","v":2031},{"$f":"'Retirement Calculations'!C147","v":""},{"$f":"'Retirement Calculations'!F147","v":{"$error":"#VALUE!"}},{"$f":"'Retirement Calculations'!I147","v":{"$error":"#VALUE!"}},{"$f":"'Retirement Calculations'!N147","v":0},{"$f":"'Retirement Calculations'!O147","v":{"$error":"#VALUE!"}},{"$f":"'Retirement Calculations'!P147","v":{"$error":"#VALUE!"}},{"$f":"'Retirement Calculations'!T147","v":{"$error":"#VALUE!"}},{"$f":"'Retirement Calculations'!Q147","v":{"$error":"#VALUE!"}},{"$f":"'Retirement Calculations'!W147","v":{"$error":"#VALUE!"}}]
[null,{"$f":"'Retirement Calculations'!B148","v":{"$error":"#VALUE!"}},{"$f":"'Retirement Calculations'!A148","v":2032},{"$f":"'Retirement Calculations'!C148","v":""},{"$f":"'Retirement Calculations'!F148","v":{"$error":"#VALUE!"}},{"$f":"'Retirement Calculations'!I148","v":{"$error":"#VALUE!"}},{"$f":"'Retirement Calculations'!N148","v":0},{"$f":"'Retirement Calculations'!O148","v":{"$error":"#VALUE!"}},{"$f":"'Retirement Calculations'!P148","v":{"$error":"#VALUE!"}},{"$f":"'Retirement Calculations'!T148","v":{"$error":"#VALUE!"}},{"$f":"'Retirement Calculations'!Q148","v":{"$error":"#VALUE!"}},{"$f":"'Retirement Calculations'!W148","v":{"$error":"#VALUE!"}}]
[null,{"$f":"'Retirement Calculations'!B149","v":{"$error":"#VALUE!"}},{"$f":"'Retirement Calculations'!A149","v":2033},{"$f":"'Retirement Calculations'!C149","v":""},{"$f":"'Retirement Calculations'!F149","v":{"$error":"#VALUE!"}},{"$f":"'Retirement Calculations'!I149","v":{"$error":"#VALUE!"}},{"$f":"'Retirement Calculations'!N149","v":0},{"$f":"'Retirement Calculations'!O149","v":{"$error":"#VALUE!"}},{"$f":"'Retirement Calculations'!P149","v":{"$error":"#VALUE!"}},{"$f":"'Retirement Calculations'!T149","v":{"$error":"#VALUE!"}},{"$f":"'Retirement Calculations'!Q149","v":{"$error":"#VALUE!"}},{"$f":"'Retirement Calculations'!W149","v":{"$error":"#VALUE!"}}]
[null,{"$f":"'Retirement Calculations'!B150","v":{"$error":"#VALUE!"}},{"$f":"'Retirement Calculations'!A150","v":2034},{"$f":"'Retirement Calculations'!C150","v":""},{"$f":"'Retirement Calculations'!F150","v":{"$error":"#VALUE!"}},{"$f":"'Retirement Calculations'!I150","v":{"$error":"#VALUE!"}},{"$f":"'Retirement Calculations'!N150","v":0},{"$f":"'Retirement Calculations'!O150","v":{"$error":"#VALUE!"}},{"$f":"'Retirement Calculations'!P150","v":{"$error":"#VALUE!"}},{"$f":"'Retirement Calculations'!T150","v":{"$error":"#VALUE!"}},{"$f":"'Retirement Calculations'!Q150","v":{"$error":"#VALUE!"}},{"$f":"'Retirement Calculations'!W150","v":{"$error":"#VALUE!"}}]
[null,{"$f":"'Retirement Calculations'!B151","v":{"$error":"#VALUE!"}},{"$f":"'Retirement Calculations'!A151","v":2035},{"$f":"'Retirement Calculations'!C151","v":""},{"$f":"'Retirement Calculations'!F151","v":{"$error":"#VALUE!"}},{"$f":"'Retirement Calculations'!I151","v":{"$error":"#VALUE!"}},{"$f":"'Retirement Calculations'!N151","v":0},{"$f":"'Retirement Calculations'!O151","v":{"$error":"#VALUE!"}},{"$f":"'Retirement Calculations'!P151","v":{"$error":"#VALUE!"}},{"$f":"'Retirement Calculations'!T151","v":{"$error":"#VALUE!"}},{"$f":"'Retirement Calculations'!Q151","v":{"$error":"#VALUE!"}},{"$f":"'Retirement Calculations'!W151","v":{"$error":"#VALUE!"}}]
[null,{"$f":"'Retirement Calculations'!B152","v":{"$error":"#VALUE!"}},{"$f":"'Retirement Calculations'!A152","v":2036},{"$f":"'Retirement Calculations'!C152","v":""},{"$f":"'Retirement Calculations'!F152","v":{"$error":"#VALUE!"}},{"$f":"'Retirement Calculations'!I152","v":{"$error":"#VALUE!"}},{"$f":"'Retirement Calculations'!N152","v":0},{"$f":"'Retirement Calculations'!O152","v":{"$error":"#VALUE!"}},{"$f":"'Retirement Calculations'!P152","v":{"$error":"#VALUE!"}},{"$f":"'Retirement Calculations'!T152","v":{"$error":"#VALUE!"}},{"$f":"'Retirement Calculations'!Q152","v":{"$error":"#VALUE!"}},{"$f":"'Retirement Calculations'!W152","v":{"$error":"#VALUE!"}}]
[null,{"$f":"'Retirement Calculations'!B153","v":{"$error":"#VALUE!"}},{"$f":"'Retirement Calculations'!A153","v":2037},{"$f":"'Retirement Calculations'!C153","v":""},{"$f":"'Retirement Calculations'!F153","v":{"$error":"#VALUE!"}},{"$f":"'Retirement Calculations'!I153","v":{"$error":"#VALUE!"}},{"$f":"'Retirement Calculations'!N153","v":0},{"$f":"'Retirement Calculations'!O153","v":{"$error":"#VALUE!"}},{"$f":"'Retirement Calculations'!P153","v":{"$error":"#VALUE!"}},{"$f":"'Retirement Calculations'!T153","v":{"$error":"#VALUE!"}},{"$f":"'Retirement Calculations'!Q153","v":{"$error":"#VALUE!"}},{"$f":"'Retirement Calculations'!W153","v":{"$error":"#VALUE!"}}]
[null,{"$f":"'Retirement Calculations'!B154","v":{"$error":"#VALUE!"}},{"$f":"'Retirement Calculations'!A154","v":2038},{"$f":"'Retirement Calculations'!C154","v":""},{"$f":"'Retirement Calculations'!F154","v":{"$error":"#VALUE!"}},{"$f":"'Retirement Calculations'!I154","v":{"$error":"#VALUE!"}},{"$f":"'Retirement Calculations'!N154","v":0},{"$f":"'Retirement Calculations'!O154","v":{"$error":"#VALUE!"}},{"$f":"'Retirement Calculations'!P154","v":{"$error":"#VALUE!"}},{"$f":"'Retirement Calculations'!T154","v":{"$error":"#VALUE!"}},{"$f":"'Retirement Calculations'!Q154","v":{"$error":"#VALUE!"}},{"$f":"'Retirement Calculations'!W154","v":{"$error":"#VALUE!"}}]
[null,{"$f":"'Retirement Calculations'!B155","v":{"$error":"#VALUE!"}},{"$f":"'Retirement Calculations'!A155","v":2039},{"$f":"'Retirement Calculations'!C155","v":""},{"$f":"'Retirement Calculations'!F155","v":{"$error":"#VALUE!"}},{"$f":"'Retirement Calculations'!I155","v":{"$error":"#VALUE!"}},{"$f":"'Retirement Calculations'!N155","v":0},{"$f":"'Retirement Calculations'!O155","v":{"$error":"#VALUE!"}},{"$f":"'Retirement Calculations'!P155","v":{"$error":"#VALUE!"}},{"$f":"'Retirement Calculations'!T155","v":{"$error":"#VALUE!"}},{"$f":"'Retirement Calculations'!Q155","v":{"$error":"#VALUE!"}},{"$f":"'Retirement Calculations'!W155","v":{"$error":"#VALUE!"}}]
[null,{"$f":"'Retirement Calculations'!B156","v":{"$error":"#VALUE!"}},{"$f":"'Retirement Calculations'!A156","v":2040},{"$f":"'Retirement Calculations'!C156","v":""},{"$f":"'Retirement Calculations'!F156","v":{"$error":"#VALUE!"}},{"$f":"'Retirement Calculations'!I156","v":{"$error":"#VALUE!"}},{"$f":"'Retirement Calculations'!N156","v":0},{"$f":"'Retirement Calculations'!O156","v":{"$error":"#VALUE!"}},{"$f":"'Retirement Calculations'!P156","v":{"$error":"#VALUE!"}},{"$f":"'Retirement Calculations'!T156","v":{"$error":"#VALUE!"}},{"$f":"'Retirement Calculations'!Q156","v":{"$error":"#VALUE!"}},{"$f":"'Retirement Calculations'!W156","v":{"$error":"#VALUE!"}}]
[null,{"$f":"'Retirement Calculations'!B157","v":{"$error":"#VALUE!"}},{"$f":"'Retirement Calculations'!A157","v":2041},{"$f":"'Retirement Calculations'!C157","v":""},{"$f":"'Retirement Calculations'!F157","v":{"$error":"#VALUE!"}},{"$f":"'Retirement Calculations'!I157","v":{"$error":"#VALUE!"}},{"$f":"'Retirement Calculations'!N157","v":0},{"$f":"'Retirement Calculations'!O157","v":{"$error":"#VALUE!"}},{"$f":"'Retirement Calculations'!P157","v":{"$error":"#VALUE!"}},{"$f":"'Retirement Calculations'!T157","v":{"$error":"#VALUE!"}},{"$f":"'Retirement Calculations'!Q157","v":{"$error":"#VALUE!"}},{"$f":"'Retirement Calculations'!W157","v":{"$error":"#VALUE!"}}]
[null,{"$f":"'Retirement Calculations'!B158","v":{"$error":"#VALUE!"}},{"$f":"'Retirement Calculations'!A158","v":2042},{"$f":"'Retirement Calculations'!C158","v":""},{"$f":"'Retirement Calculations'!F158","v":{"$error":"#VALUE!"}},{"$f":"'Retirement Calculations'!I158","v":{"$error":"#VALUE!"}},{"$f":"'Retirement Calculations'!N158","v":0},{"$f":"'Retirement Calculations'!O158","v":{"$error":"#VALUE!"}},{"$f":"'Retirement Calculations'!P158","v":{"$error":"#VALUE!"}},{"$f":"'Retirement Calculations'!T158","v":{"$error":"#VALUE!"}},{"$f":"'Retirement Calculations'!Q158","v":{"$error":"#VALUE!"}},{"$f":"'Retirement Calculations'!W158","v":{"$error":"#VALUE!"}}]
[null,{"$f":"'Retirement Calculations'!B159","v":{"$error":"#VALUE!"}},{"$f":"'Retirement Calculations'!A159","v":2043},{"$f":"'Retirement Calculations'!C159","v":""},{"$f":"'Retirement Calculations'!F159","v":{"$error":"#VALUE!"}},{"$f":"'Retirement Calculations'!I159","v":{"$error":"#VALUE!"}},{"$f":"'Retirement Calculations'!N159","v":0},{"$f":"'Retirement Calculations'!O159","v":{"$error":"#VALUE!"}},{"$f":"'Retirement Calculations'!P159","v":{"$error":"#VALUE!"}},{"$f":"'Retirement Calculations'!T159","v":{"$error":"#VALUE!"}},{"$f":"'Retirement Calculations'!Q159","v":{"$error":"#VALUE!"}},{"$f":"'Retirement Calculations'!W159","v":{"$error":"#VALUE!"}}]
[null,{"$f":"'Retirement Calculations'!B160","v":{"$error":"#VALUE!"}},{"$f":"'Retirement Calculations'!A160","v":2044},{"$f":"'Retirement Calculations'!C160","v":""},{"$f":"'Retirement Calculations'!F160","v":{"$error":"#VALUE!"}},{"$f":"'Retirement Calculations'!I160","v":{"$error":"#VALUE!"}},{"$f":"'Retirement Calculations'!N160","v":0},{"$f":"'Retirement Calculations'!O160","v":{"$error":"#VALUE!"}},{"$f":"'Retirement Calculations'!P160","v":{"$error":"#VALUE!"}},{"$f":"'Retirement Calculations'!T160","v":{"$error":"#VALUE!"}},{"$f":"'Retirement Calculations'!Q160","v":{"$error":"#VALUE!"}},{"$f":"'Retirement Calculations'!W160","v":{"$error":"#VALUE!"}}]
[null,{"$f":"'Retirement Calculations'!B161","v":{"$error":"#VALUE!"}},{"$f":"'Retirement Calculations'!A161","v":2045},{"$f":"'Retirement Calculations'!C161","v":""},{"$f":"'Retirement Calculations'!F161","v":{"$error":"#VALUE!"}},{"$f":"'Retirement Calculations'!I161","v":{"$error":"#VALUE!"}},{"$f":"'Retirement Calculations'!N161","v":0},{"$f":"'Retirement Calculations'!O161","v":{"$error":"#VALUE!"}},{"$f":"'Retirement Calculations'!P161","v":{"$error":"#VALUE!"}},{"$f":"'Retirement Calculations'!T161","v":{"$error":"#VALUE!"}},{"$f":"'Retirement Calculations'!Q161","v":{"$error":"#VALUE!"}},{"$f":"'Retirement Calculations'!W161","v":{"$error":"#VALUE!"}}]
[null,{"$f":"'Retirement Calculations'!B162","v":{"$error":"#VALUE!"}},{"$f":"'Retirement Calculations'!A162","v":2046},{"$f":"'Retirement Calculations'!C162","v":""},{"$f":"'Retirement Calculations'!F162","v":{"$error":"#VALUE!"}},{"$f":"'Retirement Calculations'!I162","v":{"$error":"#VALUE!"}},{"$f":"'Retirement Calculations'!N162","v":0},{"$f":"'Retirement Calculations'!O162","v":{"$error":"#VALUE!"}},{"$f":"'Retirement Calculations'!P162","v":{"$error":"#VALUE!"}},{"$f":"'Retirement Calculations'!T162","v":{"$error":"#VALUE!"}},{"$f":"'Retirement Calculations'!Q162","v":{"$error":"#VALUE!"}},{"$f":"'Retirement Calculations'!W162","v":{"$error":"#VALUE!"}}]
[null,{"$f":"'Retirement Calculations'!B163","v":{"$error":"#VALUE!"}},{"$f":"'Retirement Calculations'!A163","v":2047},{"$f":"'Retirement Calculations'!C163","v":""},{"$f":"'Retirement Calculations'!F163","v":{"$error":"#VALUE!"}},{"$f":"'Retirement Calculations'!I163","v":{"$error":"#VALUE!"}},{"$f":"'Retirement Calculations'!N163","v":0},{"$f":"'Retirement Calculations'!O163","v":{"$error":"#VALUE!"}},{"$f":"'Retirement Calculations'!P163","v":{"$error":"#VALUE!"}},{"$f":"'Retirement Calculations'!T163","v":{"$error":"#VALUE!"}},{"$f":"'Retirement Calculations'!Q163","v":{"$error":"#VALUE!"}},{"$f":"'Retirement Calculations'!W163","v":{"$error":"#VALUE!"}}]
[null,{"$f":"'Retirement Calculations'!B164","v":{"$error":"#VALUE!"}},{"$f":"'Retirement Calculations'!A164","v":2048},{"$f":"'Retirement Calculations'!C164","v":""},{"$f":"'Retirement Calculations'!F164","v":{"$error":"#VALUE!"}},{"$f":"'Retirement Calculations'!I164","v":{"$error":"#VALUE!"}},{"$f":"'Retirement Calculations'!N164","v":0},{"$f":"'Retirement Calculations'!O164","v":{"$error":"#VALUE!"}},{"$f":"'Retirement Calculations'!P164","v":{"$error":"#VALUE!"}},{"$f":"'Retirement Calculations'!T164","v":{"$error":"#VALUE!"}},{"$f":"'Retirement Calculations'!Q164","v":{"$error":"#VALUE!"}},{"$f":"'Retirement Calculations'!W164","v":{"$error":"#VALUE!"}}]
[null,{"$f":"'Retirement Calculations'!B165","v":{"$error":"#VALUE!"}},{"$f":"'Retirement Calculations'!A165","v":2049},{"$f":"'Retirement Calculations'!C165","v":""},{"$f":"'Retirement Calculations'!F165","v":{"$error":"#VALUE!"}},{"$f":"'Retirement Calculations'!I165","v":{"$error":"#VALUE!"}},{"$f":"'Retirement Calculations'!N165","v":0},{"$f":"'Retirement Calculations'!O165","v":{"$error":"#VALUE!"}},{"$f":"'Retirement Calculations'!P165","v":{"$error":"#VALUE!"}},{"$f":"'Retirement Calculations'!T165","v":{"$error":"#VALUE!"}},{"$f":"'Retirement Calculations'!Q165","v":{"$error":"#VALUE!"}},{"$f":"'Retirement Calculations'!W165","v":{"$error":"#VALUE!"}}]
[null,{"$f":"'Retirement Calculations'!B166","v":{"$error":"#VALUE!"}},{"$f":"'Retirement Calculations'!A166","v":2050},{"$f":"'Retirement Calculations'!C166","v":""},{"$f":"'Retirement Calculations'!F166","v":{"$error":"#VALUE!"}},{"$f":"'Retirement Calculations'!I166","v":{"$error":"#VALUE!"}},{"$f":"'Retirement Calculations'!N166","v":0},{"$f":"'Retirement Calculations'!O166","v":{"$error":"#VALUE!"}},{"$f":"'Retirement Calculations'!P166","v":{"$error":"#VALUE!"}},{"$f":"'Retirement Calculations'!T166","v":{"$error":"#VALUE!"}},{"$f":"'Retirement Calculations'!Q166","v":{"$error":"#VALUE!"}},{"$f":"'Retirement Calculations'!W166","v":{"$error":"#VALUE!"}}]
[null,{"$f":"'Retirement Calculations'!B167","v":{"$error":"#VALUE!"}},{"$f":"'Retirement Calculations'!A167","v":2051},{"$f":"'Retirement Calculations'!C167","v":""},{"$f":"'Retirement Calculations'!F167","v":{"$error":"#VALUE!"}},{"$f":"'Retirement Calculations'!I167","v":{"$error":"#VALUE!"}},{"$f":"'Retirement Calculations'!N167","v":0},{"$f":"'Retirement Calculations'!O167","v":{"$error":"#VALUE!"}},{"$f":"'Retirement Calculations'!P167","v":{"$error":"#VALUE!"}},{"$f":"'Retirement Calculations'!T167","v":{"$error":"#VALUE!"}},{"$f":"'Retirement Calculations'!Q167","v":{"$error":"#VALUE!"}},{"$f":"'Retirement Calculations'!W167","v":{"$error":"#VALUE!"}}]
[null,{"$f":"'Retirement Calculations'!B168","v":{"$error":"#VALUE!"}},{"$f":"'Retirement Calculations'!A168","v":2052},{"$f":"'Retirement Calculations'!C168","v":""},{"$f":"'Retirement Calculations'!F168","v":{"$error":"#VALUE!"}},{"$f":"'Retirement Calculations'!I168","v":{"$error":"#VALUE!"}},{"$f":"'Retirement Calculations'!N168","v":0},{"$f":"'Retirement Calculations'!O168","v":{"$error":"#VALUE!"}},{"$f":"'Retirement Calculations'!P168","v":{"$error":"#VALUE!"}},{"$f":"'Retirement Calculations'!T168","v":{"$error":"#VALUE!"}},{"$f":"'Retirement Calculations'!Q168","v":{"$error":"#VALUE!"}},{"$f":"'Retirement Calculations'!W168","v":{"$error":"#VALUE!"}}]
[null,{"$f":"'Retirement Calculations'!B169","v":{"$error":"#VALUE!"}},{"$f":"'Retirement Calculations'!A169","v":2053},{"$f":"'Retirement Calculations'!C169","v":""},{"$f":"'Retirement Calculations'!F169","v":{"$error":"#VALUE!"}},{"$f":"'Retirement Calculations'!I169","v":{"$error":"#VALUE!"}},{"$f":"'Retirement Calculations'!N169","v":0},{"$f":"'Retirement Calculations'!O169","v":{"$error":"#VALUE!"}},{"$f":"'Retirement Calculations'!P169","v":{"$error":"#VALUE!"}},{"$f":"'Retirement Calculations'!T169","v":{"$error":"#VALUE!"}},{"$f":"'Retirement Calculations'!Q169","v":{"$error":"#VALUE!"}},{"$f":"'Retirement Calculations'!W169","v":{"$error":"#VALUE!"}}]
[null,{"$f":"'Retirement Calculations'!B170","v":{"$error":"#VALUE!"}},{"$f":"'Retirement Calculations'!A170","v":2054},{"$f":"'Retirement Calculations'!C170","v":""},{"$f":"'Retirement Calculations'!F170","v":{"$error":"#VALUE!"}},{"$f":"'Retirement Calculations'!I170","v":{"$error":"#VALUE!"}},{"$f":"'Retirement Calculations'!N170","v":0},{"$f":"'Retirement Calculations'!O170","v":{"$error":"#VALUE!"}},{"$f":"'Retirement Calculations'!P170","v":{"$error":"#VALUE!"}},{"$f":"'Retirement Calculations'!T170","v":{"$error":"#VALUE!"}},{"$f":"'Retirement Calculations'!Q170","v":{"$error":"#VALUE!"}},{"$f":"'Retirement Calculations'!W170","v":{"$error":"#VALUE!"}}]
[null,{"$f":"'Retirement Calculations'!B171","v":{"$error":"#VALUE!"}},{"$f":"'Retirement Calculations'!A171","v":2055},{"$f":"'Retirement Calculations'!C171","v":""},{"$f":"'Retirement Calculations'!F171","v":{"$error":"#VALUE!"}},{"$f":"'Retirement Calculations'!I171","v":{"$error":"#VALUE!"}},{"$f":"'Retirement Calculations'!N171","v":0},{"$f":"'Retirement Calculations'!O171","v":{"$error":"#VALUE!"}},{"$f":"'Retirement Calculations'!P171","v":{"$error":"#VALUE!"}},{"$f":"'Retirement Calculations'!T171","v":{"$error":"#VALUE!"}},{"$f":"'Retirement Calculations'!Q171","v":{"$error":"#VALUE!"}},{"$f":"'Retirement Calculations'!W171","v":{"$error":"#VALUE!"}}]
[null,{"$f":"'Retirement Calculations'!B172","v":{"$error":"#VALUE!"}},{"$f":"'Retirement Calculations'!A172","v":2056},{"$f":"'Retirement Calculations'!C172","v":""},{"$f":"'Retirement Calculations'!F172","v":{"$error":"#VALUE!"}},{"$f":"'Retirement Calculations'!I172","v":{"$error":"#VALUE!"}},{"$f":"'Retirement Calculations'!N172","v":0},{"$f":"'Retirement Calculations'!O172","v":{"$error":"#VALUE!"}},{"$f":"'Retirement Calculations'!P172","v":{"$error":"#VALUE!"}},{"$f":"'Retirement Calculations'!T172","v":{"$error":"#VALUE!"}},{"$f":"'Retirement Calculations'!Q172","v":{"$error":"#VALUE!"}},{"$f":"'Retirement Calculations'!W172","v":{"$error":"#VALUE!"}}]
[null,{"$f":"'Retirement Calculations'!B173","v":{"$error":"#VALUE!"}},{"$f":"'Retirement Calculations'!A173","v":2057},{"$f":"'Retirement Calculations'!C173","v":""},{"$f":"'Retirement Calculations'!F173","v":{"$error":"#VALUE!"}},{"$f":"'Retirement Calculations'!I173","v":{"$error":"#VALUE!"}},{"$f":"'Retirement Calculations'!N173","v":0},{"$f":"'Retirement Calculations'!O173","v":{"$error":"#VALUE!"}},{"$f":"'Retirement Calculations'!P173","v":{"$error":"#VALUE!"}},{"$f":"'Retirement Calculations'!T173","v":{"$error":"#VALUE!"}},{"$f":"'Retirement Calculations'!Q173","v":{"$error":"#VALUE!"}},{"$f":"'Retirement Calculations'!W173","v":{"$error":"#VALUE!"}}]
[null,{"$f":"'Retirement Calculations'!B174","v":{"$error":"#VALUE!"}},{"$f":"'Retirement Calculations'!A174","v":2058},{"$f":"'Retirement Calculations'!C174","v":""},{"$f":"'Retirement Calculations'!F174","v":{"$error":"#VALUE!"}},{"$f":"'Retirement Calculations'!I174","v":{"$error":"#VALUE!"}},{"$f":"'Retirement Calculations'!N174","v":0},{"$f":"'Retirement Calculations'!O174","v":{"$error":"#VALUE!"}},{"$f":"'Retirement Calculations'!P174","v":{"$error":"#VALUE!"}},{"$f":"'Retirement Calculations'!T174","v":{"$error":"#VALUE!"}},{"$f":"'Retirement Calculations'!Q174","v":{"$error":"#VALUE!"}},{"$f":"'Retirement Calculations'!W174","v":{"$error":"#VALUE!"}}]
[null,{"$f":"'Retirement Calculations'!B175","v":{"$error":"#VALUE!"}},{"$f":"'Retirement Calculations'!A175","v":2059},{"$f":"'Retirement Calculations'!C175","v":""},{"$f":"'Retirement Calculations'!F175","v":{"$error":"#VALUE!"}},{"$f":"'Retirement Calculations'!I175","v":{"$error":"#VALUE!"}},{"$f":"'Retirement Calculations'!N175","v":0},{"$f":"'Retirement Calculations'!O175","v":{"$error":"#VALUE!"}},{"$f":"'Retirement Calculations'!P175","v":{"$error":"#VALUE!"}},{"$f":"'Retirement Calculations'!T175","v":{"$error":"#VALUE!"}},{"$f":"'Retirement Calculations'!Q175","v":{"$error":"#VALUE!"}},{"$f":"'Retirement Calculations'!W175","v":{"$error":"#VALUE!"}}]
[null,{"$f":"'Retirement Calculations'!B176","v":{"$error":"#VALUE!"}},{"$f":"'Retirement Calculations'!A176","v":2060},{"$f":"'Retirement Calculations'!C176","v":""},{"$f":"'Retirement Calculations'!F176","v":{"$error":"#VALUE!"}},{"$f":"'Retirement Calculations'!I176","v":{"$error":"#VALUE!"}},{"$f":"'Retirement Calculations'!N176","v":0},{"$f":"'Retirement Calculations'!O176","v":{"$error":"#VALUE!"}},{"$f":"'Retirement Calculations'!P176","v":{"$error":"#VALUE!"}},{"$f":"'Retirement Calculations'!T176","v":{"$error":"#VALUE!"}},{"$f":"'Retirement Calculations'!Q176","v":{"$error":"#VALUE!"}},{"$f":"'Retirement Calculations'!W176","v":{"$error":"#VALUE!"}}]
[null,{"$f":"'Retirement Calculations'!B177","v":{"$error":"#VALUE!"}},{"$f":"'Retirement Calculations'!A177","v":2061},{"$f":"'Retirement Calculations'!C177","v":""},{"$f":"'Retirement Calculations'!F177","v":{"$error":"#VALUE!"}},{"$f":"'Retirement Calculations'!I177","v":{"$error":"#VALUE!"}},{"$f":"'Retirement Calculations'!N177","v":0},{"$f":"'Retirement Calculations'!O177","v":{"$error":"#VALUE!"}},{"$f":"'Retirement Calculations'!P177","v":{"$error":"#VALUE!"}},{"$f":"'Retirement Calculations'!T177","v":{"$error":"#VALUE!"}},{"$f":"'Retirement Calculations'!Q177","v":{"$error":"#VALUE!"}},{"$f":"'Retirement Calculations'!W177","v":{"$error":"#VALUE!"}}]
[null,{"$f":"'Retirement Calculations'!B178","v":{"$error":"#VALUE!"}},{"$f":"'Retirement Calculations'!A178","v":2062},{"$f":"'Retirement Calculations'!C178","v":""},{"$f":"'Retirement Calculations'!F178","v":{"$error":"#VALUE!"}},{"$f":"'Retirement Calculations'!I178","v":{"$error":"#VALUE!"}},{"$f":"'Retirement Calculations'!N178","v":0},{"$f":"'Retirement Calculations'!O178","v":{"$error":"#VALUE!"}},{"$f":"'Retirement Calculations'!P178","v":{"$error":"#VALUE!"}},{"$f":"'Retirement Calculations'!T178","v":{"$error":"#VALUE!"}},{"$f":"'Retirement Calculations'!Q178","v":{"$error":"#VALUE!"}},{"$f":"'Retirement Calculations'!W178","v":{"$error":"#VALUE!"}}]
[null,{"$f":"'Retirement Calculations'!B179","v":{"$error":"#VALUE!"}},{"$f":"'Retirement Calculations'!A179","v":2063},{"$f":"'Retirement Calculations'!C179","v":""},{"$f":"'Retirement Calculations'!F179","v":{"$error":"#VALUE!"}},{"$f":"'Retirement Calculations'!I179","v":{"$error":"#VALUE!"}},{"$f":"'Retirement Calculations'!N179","v":0},{"$f":"'Retirement Calculations'!O179","v":{"$error":"#VALUE!"}},{"$f":"'Retirement Calculations'!P179","v":{"$error":"#VALUE!"}},{"$f":"'Retirement Calculations'!T179","v":{"$error":"#VALUE!"}},{"$f":"'Retirement Calculations'!Q179","v":{"$error":"#VALUE!"}},{"$f":"'Retirement Calculations'!W179","v":{"$error":"#VALUE!"}}]
[null,{"$f":"'Retirement Calculations'!B180","v":{"$error":"#VALUE!"}},{"$f":"'Retirement Calculations'!A180","v":2064},{"$f":"'Retirement Calculations'!C180","v":""},{"$f":"'Retirement Calculations'!F180","v":{"$error":"#VALUE!"}},{"$f":"'Retirement Calculations'!I180","v":{"$error":"#VALUE!"}},{"$f":"'Retirement Calculations'!N180","v":0},{"$f":"'Retirement Calculations'!O180","v":{"$error":"#VALUE!"}},{"$f":"'Retirement Calculations'!P180","v":{"$error":"#VALUE!"}},{"$f":"'Retirement Calculations'!T180","v":{"$error":"#VALUE!"}},{"$f":"'Retirement Calculations'!Q180","v":{"$error":"#VALUE!"}},{"$f":"'Retirement Calculations'!W180","v":{"$error":"#VALUE!"}}]
[null,{"$f":"'Retirement Calculations'!B181","v":{"$error":"#VALUE!"}},{"$f":"'Retirement Calculations'!A181","v":2065},{"$f":"'Retirement Calculations'!C181","v":""},{"$f":"'Retirement Calculations'!F181","v":{"$error":"#VALUE!"}},{"$f":"'Retirement Calculations'!I181","v":{"$error":"#VALUE!"}},{"$f":"'Retirement Calculations'!N181","v":0},{"$f":"'Retirement Calculations'!O181","v":{"$error":"#VALUE!"}},{"$f":"'Retirement Calculations'!P181","v":{"$error":"#VALUE!"}},{"$f":"'Retirement Calculations'!T181","v":{"$error":"#VALUE!"}},{"$f":"'Retirement Calculations'!Q181","v":{"$error":"#VALUE!"}},{"$f":"'Retirement Calculations'!W181","v":{"$error":"#VALUE!"}}]
[null,{"$f":"'Retirement Calculations'!B182","v":{"$error":"#VALUE!"}},{"$f":"'Retirement Calculations'!A182","v":2066},{"$f":"'Retirement Calculations'!C182","v":""},{"$f":"'Retirement Calculations'!F182","v":{"$error":"#VALUE!"}},{"$f":"'Retirement Calculations'!I182","v":{"$error":"#VALUE!"}},{"$f":"'Retirement Calculations'!N182","v":0},{"$f":"'Retirement Calculations'!O182","v":{"$error":"#VALUE!"}},{"$f":"'Retirement Calculations'!P182","v":{"$error":"#VALUE!"}},{"$f":"'Retirement Calculations'!T182","v":{"$error":"#VALUE!"}},{"$f":"'Retirement Calculations'!Q182","v":{"$error":"#VALUE!"}},{"$f":"'Retirement Calculations'!W182","v":{"$error":"#VALUE!"}}]
[null,{"$f":"'Retirement Calculations'!B183","v":{"$error":"#VALUE!"}},{"$f":"'Retirement Calculations'!A183","v":2067},{"$f":"'Retirement Calculations'!C183","v":""},{"$f":"'Retirement Calculations'!F183","v":{"$error":"#VALUE!"}},{"$f":"'Retirement Calculations'!I183","v":{"$error":"#VALUE!"}},{"$f":"'Retirement Calculations'!N183","v":0},{"$f":"'Retirement Calculations'!O183","v":{"$error":"#VALUE!"}},{"$f":"'Retirement Calculations'!P183","v":{"$error":"#VALUE!"}},{"$f":"'Retirement Calculations'!T183","v":{"$error":"#VALUE!"}},{"$f":"'Retirement Calculations'!Q183","v":{"$error":"#VALUE!"}},{"$f":"'Retirement Calculations'!W183","v":{"$error":"#VALUE!"}}]
[null,{"$f":"'Retirement Calculations'!B184","v":{"$error":"#VALUE!"}},{"$f":"'Retirement Calculations'!A184","v":2068},{"$f":"'Retirement Calculations'!C184","v":""},{"$f":"'Retirement Calculations'!F184","v":{"$error":"#VALUE!"}},{"$f":"'Retirement Calculations'!I184","v":{"$error":"#VALUE!"}},{"$f":"'Retirement Calculations'!N184","v":0},{"$f":"'Retirement Calculations'!O184","v":{"$error":"#VALUE!"}},{"$f":"'Retirement Calculations'!P184","v":{"$error":"#VALUE!"}},{"$f":"'Retirement Calculations'!T184","v":{"$error":"#VALUE!"}},{"$f":"'Retirement Calculations'!Q184","v":{"$error":"#VALUE!"}},{"$f":"'Retirement Calculations'!W184","v":{"$error":"#VALUE!"}}]
[null,{"$f":"'Retirement Calculations'!B185","v":{"$error":"#VALUE!"}},{"$f":"'Retirement Calculations'!A185","v":2069},{"$f":"'Retirement Calculations'!C185","v":""},{"$f":"'Retirement Calculations'!F185","v":{"$error":"#VALUE!"}},{"$f":"'Retirement Calculations'!I185","v":{"$error":"#VALUE!"}},{"$f":"'Retirement Calculations'!N185","v":0},{"$f":"'Retirement Calculations'!O185","v":{"$error":"#VALUE!"}},{"$f":"'Retirement Calculations'!P185","v":{"$error":"#VALUE!"}},{"$f":"'Retirement Calculations'!T185","v":{"$error":"#VALUE!"}},{"$f":"'Retirement Calculations'!Q185","v":{"$error":"#VALUE!"}},{"$f":"'Retirement Calculations'!W185","v":{"$error":"#VALUE!"}}]
[null,{"$f":"'Retirement Calculations'!B186","v":{"$error":"#VALUE!"}},{"$f":"'Retirement Calculations'!A186","v":2070},{"$f":"'Retirement Calculations'!C186","v":""},{"$f":"'Retirement Calculations'!F186","v":{"$error":"#VALUE!"}},{"$f":"'Retirement Calculations'!I186","v":{"$error":"#VALUE!"}},{"$f":"'Retirement Calculations'!N186","v":0},{"$f":"'Retirement Calculations'!O186","v":{"$error":"#VALUE!"}},{"$f":"'Retirement Calculations'!P186","v":{"$error":"#VALUE!"}},{"$f":"'Retirement Calculations'!T186","v":{"$error":"#VALUE!"}},{"$f":"'Retirement Calculations'!Q186","v":{"$error":"#VALUE!"}},{"$f":"'Retirement Calculations'!W186","v":{"$error":"#VALUE!"}}]
[null,{"$f":"'Retirement Calculations'!B187","v":{"$error":"#VALUE!"}},{"$f":"'Retirement Calculations'!A187","v":2071},{"$f":"'Retirement Calculations'!C187","v":""},{"$f":"'Retirement Calculations'!F187","v":{"$error":"#VALUE!"}},{"$f":"'Retirement Calculations'!I187","v":{"$error":"#VALUE!"}},{"$f":"'Retirement Calculations'!N187","v":0},{"$f":"'Retirement Calculations'!O187","v":{"$error":"#VALUE!"}},{"$f":"'Retirement Calculations'!P187","v":{"$error":"#VALUE!"}},{"$f":"'Retirement Calculations'!T187","v":{"$error":"#VALUE!"}},{"$f":"'Retirement Calculations'!Q187","v":{"$error":"#VALUE!"}},{"$f":"'Retirement Calculations'!W187","v":{"$error":"#VALUE!"}}]
[null,{"$f":"'Retirement Calculations'!B188","v":{"$error":"#VALUE!"}},{"$f":"'Retirement Calculations'!A188","v":2072},{"$f":"'Retirement Calculations'!C188","v":""},{"$f":"'Retirement Calculations'!F188","v":{"$error":"#VALUE!"}},{"$f":"'Retirement Calculations'!I188","v":{"$error":"#VALUE!"}},{"$f":"'Retirement Calculations'!N188","v":0},{"$f":"'Retirement Calculations'!O188","v":{"$error":"#VALUE!"}},{"$f":"'Retirement Calculations'!P188","v":{"$error":"#VALUE!"}},{"$f":"'Retirement Calculations'!T188","v":{"$error":"#VALUE!"}},{"$f":"'Retirement Calculations'!Q188","v":{"$error":"#VALUE!"}},{"$f":"'Retirement Calculations'!W188","v":{"$error":"#VALUE!"}}]
[null,{"$f":"'Retirement Calculations'!B189","v":{"$error":"#VALUE!"}},{"$f":"'Retirement Calculations'!A189","v":2073},{"$f":"'Retirement Calculations'!C189","v":""},{"$f":"'Retirement Calculations'!F189","v":{"$error":"#VALUE!"}},{"$f":"'Retirement Calculations'!I189","v":{"$error":"#VALUE!"}},{"$f":"'Retirement Calculations'!N189","v":0},{"$f":"'Retirement Calculations'!O189","v":{"$error":"#VALUE!"}},{"$f":"'Retirement Calculations'!P189","v":{"$error":"#VALUE!"}},{"$f":"'Retirement Calculations'!T189","v":{"$error":"#VALUE!"}},{"$f":"'Retirement Calculations'!Q189","v":{"$error":"#VALUE!"}},{"$f":"'Retirement Calculations'!W189","v":{"$error":"#VALUE!"}}]
[null,{"$f":"'Retirement Calculations'!B190","v":{"$error":"#VALUE!"}},{"$f":"'Retirement Calculations'!A190","v":2074},{"$f":"'Retirement Calculations'!C190","v":""},{"$f":"'Retirement Calculations'!F190","v":{"$error":"#VALUE!"}},{"$f":"'Retirement Calculations'!I190","v":{"$error":"#VALUE!"}},{"$f":"'Retirement Calculations'!N190","v":0},{"$f":"'Retirement Calculations'!O190","v":{"$error":"#VALUE!"}},{"$f":"'Retirement Calculations'!P190","v":{"$error":"#VALUE!"}},{"$f":"'Retirement Calculations'!T190","v":{"$error":"#VALUE!"}},{"$f":"'Retirement Calculations'!Q190","v":{"$error":"#VALUE!"}},{"$f":"'Retirement Calculations'!W190","v":{"$error":"#VALUE!"}}]
[null,{"$f":"'Retirement Calculations'!B191","v":{"$error":"#VALUE!"}},{"$f":"'Retirement Calculations'!A191","v":2075},{"$f":"'Retirement Calculations'!C191","v":""},{"$f":"'Retirement Calculations'!F191","v":{"$error":"#VALUE!"}},{"$f":"'Retirement Calculations'!I191","v":{"$error":"#VALUE!"}},{"$f":"'Retirement Calculations'!N191","v":0},{"$f":"'Retirement Calculations'!O191","v":{"$error":"#VALUE!"}},{"$f":"'Retirement Calculations'!P191","v":{"$error":"#VALUE!"}},{"$f":"'Retirement Calculations'!T191","v":{"$error":"#VALUE!"}},{"$f":"'Retirement Calculations'!Q191","v":{"$error":"#VALUE!"}},{"$f":"'Retirement Calculations'!W191","v":{"$error":"#VALUE!"}}]
[null,{"$f":"'Retirement Calculations'!B192","v":{"$error":"#VALUE!"}},{"$f":"'Retirement Calculations'!A192","v":2076},{"$f":"'Retirement Calculations'!C192","v":""},{"$f":"'Retirement Calculations'!F192","v":{"$error":"#VALUE!"}},{"$f":"'Retirement Calculations'!I192","v":{"$error":"#VALUE!"}},{"$f":"'Retirement Calculations'!N192","v":0},{"$f":"'Retirement Calculations'!O192","v":{"$error":"#VALUE!"}},{"$f":"'Retirement Calculations'!P192","v":{"$error":"#VALUE!"}},{"$f":"'Retirement Calculations'!T192","v":{"$error":"#VALUE!"}},{"$f":"'Retirement Calculations'!Q192","v":{"$error":"#VALUE!"}},{"$f":"'Retirement Calculations'!W192","v":{"$error":"#VALUE!"}}]
[null,{"$f":"'Retirement Calculations'!B193","v":{"$error":"#VALUE!"}},{"$f":"'Retirement Calculations'!A193","v":2077},{"$f":"'Retirement Calculations'!C193","v":""},{"$f":"'Retirement Calculations'!F193","v":{"$error":"#VALUE!"}},{"$f":"'Retirement Calculations'!I193","v":{"$error":"#VALUE!"}},{"$f":"'Retirement Calculations'!N193","v":0},{"$f":"'Retirement Calculations'!O193","v":{"$error":"#VALUE!"}},{"$f":"'Retirement Calculations'!P193","v":{"$error":"#VALUE!"}},{"$f":"'Retirement Calculations'!T193","v":{"$error":"#VALUE!"}},{"$f":"'Retirement Calculations'!Q193","v":{"$error":"#VALUE!"}},{"$f":"'Retirement Calculations'!W193","v":{"$error":"#VALUE!"}}]
[null,{"$f":"'Retirement Calculations'!B194","v":{"$error":"#VALUE!"}},{"$f":"'Retirement Calculations'!A194","v":2078},{"$f":"'Retirement Calculations'!C194","v":""},{"$f":"'Retirement Calculations'!F194","v":{"$error":"#VALUE!"}},{"$f":"'Retirement Calculations'!I194","v":{"$error":"#VALUE!"}},{"$f":"'Retirement Calculations'!N194","v":0},{"$f":"'Retirement Calculations'!O194","v":{"$error":"#VALUE!"}},{"$f":"'Retirement Calculations'!P194","v":{"$error":"#VALUE!"}},{"$f":"'Retirement Calculations'!T194","v":{"$error":"#VALUE!"}},{"$f":"'Retirement Calculations'!Q194","v":{"$error":"#VALUE!"}},{"$f":"'Retirement Calculations'!W194","v":{"$error":"#VALUE!"}}]
[null,{"$f":"'Retirement Calculations'!B195","v":{"$error":"#VALUE!"}},{"$f":"'Retirement Calculations'!A195","v":2079},{"$f":"'Retirement Calculations'!C195","v":""},{"$f":"'Retirement Calculations'!F195","v":{"$error":"#VALUE!"}},{"$f":"'Retirement Calculations'!I195","v":{"$error":"#VALUE!"}},{"$f":"'Retirement Calculations'!N195","v":0},{"$f":"'Retirement Calculations'!O195","v":{"$error":"#VALUE!"}},{"$f":"'Retirement Calculations'!P195","v":{"$error":"#VALUE!"}},{"$f":"'Retirement Calculations'!T195","v":{"$error":"#VALUE!"}},{"$f":"'Retirement Calculations'!Q195","v":{"$error":"#VALUE!"}},{"$f":"'Retirement Calculations'!W195","v":{"$error":"#VALUE!"}}]
[null,{"$f":"'Retirement Calculations'!B196","v":{"$error":"#VALUE!"}},{"$f":"'Retirement Calculations'!A196","v":2080},{"$f":"'Retirement Calculations'!C196","v":""},{"$f":"'Retirement Calculations'!F196","v":{"$error":"#VALUE!"}},{"$f":"'Retirement Calculations'!I196","v":{"$error":"#VALUE!"}},{"$f":"'Retirement Calculations'!N196","v":0},{"$f":"'Retirement Calculations'!O196","v":{"$error":"#VALUE!"}},{"$f":"'Retirement Calculations'!P196","v":{"$error":"#VALUE!"}},{"$f":"'Retirement Calculations'!T196","v":{"$error":"#VALUE!"}},{"$f":"'Retirement Calculations'!Q196","v":{"$error":"#VALUE!"}},{"$f":"'Retirement Calculations'!W196","v":{"$error":"#VALUE!"}}]
[null,{"$f":"'Retirement Calculations'!B197","v":{"$error":"#VALUE!"}},{"$f":"'Retirement Calculations'!A197","v":2081},{"$f":"'Retirement Calculations'!C197","v":""},{"$f":"'Retirement Calculations'!F197","v":{"$error":"#VALUE!"}},{"$f":"'Retirement Calculations'!I197","v":{"$error":"#VALUE!"}},{"$f":"'Retirement Calculations'!N197","v":0},{"$f":"'Retirement Calculations'!O197","v":{"$error":"#VALUE!"}},{"$f":"'Retirement Calculations'!P197","v":{"$error":"#VALUE!"}},{"$f":"'Retirement Calculations'!T197","v":{"$error":"#VALUE!"}},{"$f":"'Retirement Calculations'!Q197","v":{"$error":"#VALUE!"}},{"$f":"'Retirement Calculations'!W197","v":{"$error":"#VALUE!"}}]
[null,{"$f":"'Retirement Calculations'!B198","v":{"$error":"#VALUE!"}},{"$f":"'Retirement Calculations'!A198","v":2082},{"$f":"'Retirement Calculations'!C198","v":""},{"$f":"'Retirement Calculations'!F198","v":{"$error":"#VALUE!"}},{"$f":"'Retirement Calculations'!I198","v":{"$error":"#VALUE!"}},{"$f":"'Retirement Calculations'!N198","v":0},{"$f":"'Retirement Calculations'!O198","v":{"$error":"#VALUE!"}},{"$f":"'Retirement Calculations'!P198","v":{"$error":"#VALUE!"}},{"$f":"'Retirement Calculations'!T198","v":{"$error":"#VALUE!"}},{"$f":"'Retirement Calculations'!Q198","v":{"$error":"#VALUE!"}},{"$f":"'Retirement Calculations'!W198","v":{"$error":"#VALUE!"}}]
[null,{"$f":"'Retirement Calculations'!B199","v":{"$error":"#VALUE!"}},{"$f":"'Retirement Calculations'!A199","v":2083},{"$f":"'Retirement Calculations'!C199","v":""},{"$f":"'Retirement Calculations'!F199","v":{"$error":"#VALUE!"}},{"$f":"'Retirement Calculations'!I199","v":{"$error":"#VALUE!"}},{"$f":"'Retirement Calculations'!N199","v":0},{"$f":"'Retirement Calculations'!O199","v":{"$error":"#VALUE!"}},{"$f":"'Retirement Calculations'!P199","v":{"$error":"#VALUE!"}},{"$f":"'Retirement Calculations'!T199","v":{"$error":"#VALUE!"}},{"$f":"'Retirement Calculations'!Q199","v":{"$error":"#VALUE!"}},{"$f":"'Retirement Calculations'!W199","v":{"$error":"#VALUE!"}}]
[null,{"$f":"'Retirement Calculations'!B200","v":{"$error":"#VALUE!"}},{"$f":"'Retirement Calculations'!A200","v":2084},{"$f":"'Retirement Calculations'!C200","v":""},{"$f":"'Retirement Calculations'!F200","v":{"$error":"#VALUE!"}},{"$f":"'Retirement Calculations'!I200","v":{"$error":"#VALUE!"}},{"$f":"'Retirement Calculations'!N200","v":0},{"$f":"'Retirement Calculations'!O200","v":{"$error":"#VALUE!"}},{"$f":"'Retirement Calculations'!P200","v":{"$error":"#VALUE!"}},{"$f":"'Retirement Calculations'!T200","v":{"$error":"#VALUE!"}},{"$f":"'Retirement Calculations'!Q200","v":{"$error":"#VALUE!"}},{"$f":"'Retirement Calculations'!W200","v":{"$error":"#VALUE!"}}]
[null,{"$f":"'Retirement Calculations'!B201","v":{"$error":"#VALUE!"}},{"$f":"'Retirement Calculations'!A201","v":2085},{"$f":"'Retirement Calculations'!C201","v":""},{"$f":"'Retirement Calculations'!F201","v":{"$error":"#VALUE!"}},{"$f":"'Retirement Calculations'!I201","v":{"$error":"#VALUE!"}},{"$f":"'Retirement Calculations'!N201","v":0},{"$f":"'Retirement Calculations'!O201","v":{"$error":"#VALUE!"}},{"$f":"'Retirement Calculations'!P201","v":{"$error":"#VALUE!"}},{"$f":"'Retirement Calculations'!T201","v":{"$error":"#VALUE!"}},{"$f":"'Retirement Calculations'!Q201","v":{"$error":"#VALUE!"}},{"$f":"'Retirement Calculations'!W201","v":{"$error":"#VALUE!"}}]
[null,{"$f":"'Retirement Calculations'!B202","v":{"$error":"#VALUE!"}},{"$f":"'Retirement Calculations'!A202","v":2086},{"$f":"'Retirement Calculations'!C202","v":""},{"$f":"'Retirement Calculations'!F202","v":{"$error":"#VALUE!"}},{"$f":"'Retirement Calculations'!I202","v":{"$error":"#VALUE!"}},{"$f":"'Retirement Calculations'!N202","v":0},{"$f":"'Retirement Calculations'!O202","v":{"$error":"#VALUE!"}},{"$f":"'Retirement Calculations'!P202","v":{"$error":"#VALUE!"}},{"$f":"'Retirement Calculations'!T202","v":{"$error":"#VALUE!"}},{"$f":"'Retirement Calculations'!Q202","v":{"$error":"#VALUE!"}},{"$f":"'Retirement Calculations'!W202","v":{"$error":"#VALUE!"}}]
[null,{"$f":"'Retirement Calculations'!B203","v":{"$error":"#VALUE!"}},{"$f":"'Retirement Calculations'!A203","v":2087},{"$f":"'Retirement Calculations'!C203","v":""},{"$f":"'Retirement Calculations'!F203","v":{"$error":"#VALUE!"}},{"$f":"'Retirement Calculations'!I203","v":{"$error":"#VALUE!"}},{"$f":"'Retirement Calculations'!N203","v":0},{"$f":"'Retirement Calculations'!O203","v":{"$error":"#VALUE!"}},{"$f":"'Retirement Calculations'!P203","v":{"$error":"#VALUE!"}},{"$f":"'Retirement Calculations'!T203","v":{"$error":"#VALUE!"}},{"$f":"'Retirement Calculations'!Q203","v":{"$error":"#VALUE!"}},{"$f":"'Retirement Calculations'!W203","v":{"$error":"#VALUE!"}}]
[null,{"$f":"'Retirement Calculations'!B204","v":{"$error":"#VALUE!"}},{"$f":"'Retirement Calculations'!A204","v":2088},{"$f":"'Retirement Calculations'!C204","v":""},{"$f":"'Retirement Calculations'!F204","v":{"$error":"#VALUE!"}},{"$f":"'Retirement Calculations'!I204","v":{"$error":"#VALUE!"}},{"$f":"'Retirement Calculations'!N204","v":0},{"$f":"'Retirement Calculations'!O204","v":{"$error":"#VALUE!"}},{"$f":"'Retirement Calculations'!P204","v":{"$error":"#VALUE!"}},{"$f":"'Retirement Calculations'!T204","v":{"$error":"#VALUE!"}},{"$f":"'Retirement Calculations'!Q204","v":{"$error":"#VALUE!"}},{"$f":"'Retirement Calculations'!W204","v":{"$error":"#VALUE!"}}]
[null,{"$f":"'Retirement Calculations'!B205","v":{"$error":"#VALUE!"}},{"$f":"'Retirement Calculations'!A205","v":2089},{"$f":"'Retirement Calculations'!C205","v":""},{"$f":"'Retirement Calculations'!F205","v":{"$error":"#VALUE!"}},{"$f":"'Retirement Calculations'!I205","v":{"$error":"#VALUE!"}},{"$f":"'Retirement Calculations'!N205","v":0},{"$f":"'Retirement Calculations'!O205","v":{"$error":"#VALUE!"}},{"$f":"'Retirement Calculations'!P205","v":{"$error":"#VALUE!"}},{"$f":"'Retirement Calculations'!T205","v":{"$error":"#VALUE!"}},{"$f":"'Retirement Calculations'!Q205","v":{"$error":"#VALUE!"}},{"$f":"'Retirement Calculations'!W205","v":{"$error":"#VALUE!"}}]
[null,{"$f":"'Retirement Calculations'!B206","v":{"$error":"#VALUE!"}},{"$f":"'Retirement Calculations'!A206","v":2090},{"$f":"'Retirement Calculations'!C206","v":""},{"$f":"'Retirement Calculations'!F206","v":{"$error":"#VALUE!"}},{"$f":"'Retirement Calculations'!I206","v":{"$error":"#VALUE!"}},{"$f":"'Retirement Calculations'!N206","v":0},{"$f":"'Retirement Calculations'!O206","v":{"$error":"#VALUE!"}},{"$f":"'Retirement Calculations'!P206","v":{"$error":"#VALUE!"}},{"$f":"'Retirement Calculations'!T206","v":{"$error":"#VALUE!"}},{"$f":"'Retirement Calculations'!Q206","v":{"$error":"#VALUE!"}},{"$f":"'Retirement Calculations'!W206","v":{"$error":"#VALUE!"}}]
[]
[null,"Comments & Assumptions"]
[null,1]
[null,2]
[null,3]
[null,4]
[null,5]
[null,6]
[null,7]
[null,8]
[null,9]
[null,10]

{"sheet":"Macros","index":32,"n_rows":0,"n_cols":0,"rows_kept":0,"cut":false,"hidden":true,"merged":[]}

{"sheet":"Savings Guide","index":33,"n_rows":16,"n_cols":5,"rows_kept":16,"cut":false,"hidden":true,"merged":[[13,2,13,4],[3,3,3,4],[3,2,4,2],[2,2,2,4]]}
[]
[]
[null,null,"Savings Guide"]
[null,null,"Save Per Month","Encountering an Emergency"]
[null,"Monthly Savings Rate",null,"6 Mos.' Worth","8 Mos.' Worth"]
[null,0.01,{"$f":"'Income Summary'!$F$13*B6","v":0},{"$f":"ROUNDDOWN(C6*6,-1)","v":0},{"$f":"ROUNDDOWN(C6*8,-1)","v":0}]
[null,0.02,{"$f":"'Income Summary'!$F$13*B7","v":0},0,0]
[null,0.03,{"$f":"'Income Summary'!$F$13*B8","v":0},0,0]
[null,0.04,{"$f":"'Income Summary'!$F$13*B9","v":0},0,0]
[null,0.05,{"$f":"'Income Summary'!$F$13*B10","v":0},0,0]
[null,0.06,{"$f":"'Income Summary'!$F$13*B11","v":0},0,0]
[null,7.0000000000000007E-2,{"$f":"'Income Summary'!$F$13*B12","v":0},0,0]
[]
[null,null,"Emergency Account Goal"]
[null,null,"2 Mos' Worth","3 Mos' Worth","6 Mos' Worth"]
[null,null,{"$f":"'Current Spending Analysis'!$B$4*2","v":{"$error":"#VALUE!"}},{"$f":"'Current Spending Analysis'!$B$4*3","v":{"$error":"#VALUE!"}},{"$f":"'Current Spending Analysis'!$B$4*6","v":{"$error":"#VALUE!"}}]

{"sheet":"Spending Guides","index":34,"n_rows":122,"n_cols":17,"rows_kept":122,"cut":false,"hidden":true,"merged":[[104,0,104,16],[2,0,2,16],[24,0,24,16],[63,0,63,16],[84,0,84,16],[44,0,44,16]]}
[{"$f":"SUBSTITUTE('Income Summary'!I13,\" \",\"\")","v":""}]
[]
["Single None"]
["Income Level",null,20000,30000,40000,50000,60000,70000,80000,90000,100000,110000,120000,140000,160000,180000,200000]
[]
[" Taxes",null,"15 %","16 %","19 %","22 %","23 %","25 %","29 %","30 %","32 %","34 %","36 %","38 %","38 %","38 %","38 %"]
[" Giving",null,"5 - 10 %","5 - 10 %","5 - 10 %","5 - 15 %","5 - 18 %","5 - 20 %","5 - 22 %","5 - 24 %","5 - 25 %","5 - 27 %","5 - 30 %","5 - 30 %","5 - 30 %","5 - 30 %","5 - 30 %"]
[" Savings",null,"5 - 6 %","5 - 7 %","6 - 7 %","3 - 5 %","3 - 5 %","3 - 5 %","3 - 5 %","3 - 5 %","2 - 5 %","2 - 5 %","1 - 5 %","1 - 5 %","1 - 5 %","1 - 5 %","1 - 5 %"]
[" Debt (non mortgage)",null,"0 - 5 %","0 - 5 %","0 - 5 %","0 - 5 %","0 - 5 %","0 - 5 %","0 - 5 %","0 - 5 %","0 - 5 %","0 - 5 %","0 - 5 %","0 - 5 %","0 - 5 %","0 - 5 %","0 - 5 %"]
[]
[" Housing",null,"22 - 28 %","22 - 27 %","22 - 28 %","18 - 24 %","17 - 23 %","15 - 23 %","15 - 23 %","12 - 23 %","12 - 21 %","12 - 21 %","11 - 21 %","11 - 19 %","11 - 19 %","11 - 19 %","11 - 19 %"]
[" Auto",null,"12 %","10 %","9 %","7 %","6 %","5 %","4 %","4 %","4 %","3 %","3 %","2 %","2 %","2 %","2 %"]
[" Insurance",null,"4 %","4 %","4 %","3 %","3 %","3 %","3 %","3 %","3 %","3 %","3 %","3 %","3 %","3 %","3 %"]
[" Food",null,"12 %","12 %","11 %","10 %","10 %","10 %","9 %","9 %","9 %","8 %","6 %","5 %","5 %","5 %","5 %"]
[" Medical",null,"4 - 5 %","5 - 6 %","5 - 6 %","3 - 5 %","3 - 5 %","2 - 5 %","2 - 4 %","2 - 4 %","1 - 4 %","1 - 4 %","1 - 4 %","1 - 4 %","1 - 4 %","1 - 4 %","1 - 4 %"]
[" Children",null,"0 %","0 %","0 %","0 %","0 %","0 %","0 %","0 %","0 %","0 %","0 %","0 %","0 %","0 %","0 %"]
[" Clothing",null,"3 - 4 %","3 - 4 %","2 - 3 %","2 - 4 %","1 - 4 %","1 - 3 %","1 - 3 %","1 - 3 %","1 - 3 %","1 - 3 %","1 - 3 %","1 - 3 %","1 - 3 %","1 - 3 %","1 - 3 %"]
["Entertainment",null,"5 - 6 %","5 - 6 %","4 - 5 %","2 - 4 %","2 - 4 %","2 - 4 %","2 - 4 %","2 - 4 %","2 - 4 %","1 - 4 %","1 - 4 %","1 - 4 %","1 - 4 %","1 - 4 %","1 - 4 %"]
[" Misc.",null,"3 %","3 %","3 %","3 %","2 - 3 %","2 - 3 %","2 - 3 %","2 - 3 %","2 - 3 %","1 - 3 %","1 - 3 %","1 - 3 %","1 - 3 %","1 - 3 %","1 - 3 %"]
["TOTAL EXPENSE",null,"70 - 80 %"," 69 -79 %","66 - 76 %","58 - 73 %","54 - 72 %","50 - 70 %","46 - 66 %","41 - 65 %","38 - 63 %","34 - 61 %","29 - 59 %","27 - 57 %","27 - 57 %","27 - 57 %","27 - 57%"]
["RANGES"]
[]
[]
[]
["Married None"]
["Income Level",null,20000,30000,40000,50000,60000,70000,80000,90000,100000,110000,120000,140000,160000,180000,200000]
[]
[" Taxes",null,"15 %","16 %","19 %","22 %","23 %","25 %","29 %","30 %","32 %","34 %","36 %","38 %","38 %","38 %","38 %"]
[" Giving",null,"5 - 10 %","5 - 10 %","5 - 10 %","5 - 15 %","5 - 18 %","5 - 20 %","5 - 22 %","5 - 24 %","5 - 25 %","5 - 27 %","5 - 30 %","5 - 30 %","5 - 30 %","5 - 30 %","5 - 30 %"]
[" Savings",null,"5 - 6 %","5 - 7 %","6 - 7 %","3 - 5 %","3 - 5 %","3 - 5 %","3 - 5 %","3 - 5 %","2 - 5 %","2 - 5 %","1 - 5 %","1 - 5 %","1 - 5 %","1 - 5 %","1 - 5 %"]
[" Debt (non mortgage)",null,"0 - 5 %","0 - 5 %","0 - 5 %","0 - 5 %","0 - 5 %","0 - 5 %","0 - 5 %","0 - 5 %","0 - 5 %","0 - 5 %","0 - 5 %","0 - 5 %","0 - 5 %","0 - 5 %","0 - 5 %"]
[]
[" Housing",null,"22 - 28 %","22 - 27 %","22 - 28 %","18 - 24 %","17 - 23 %","15 - 23 %","15 - 23 %","12 - 23 %","12 - 21 %","12 - 21 %","11 - 21 %","11 - 19 %","11 - 19 %","11 - 19 %","11 - 19 %"]
[" Auto",null,"12 %","10 %","9 %","7 %","6 %","5 %","4 %","4 %","4 %","3 %","3 %","2 %","2 %","2 %","2 %"]
[" Insurance",null,"4 %","4 %","4 %","3 %","3 %","3 %","3 %","3 %","3 %","3 %","3 %","3 %","3 %","3 %","3 %"]
[" Food",null,"12 %","12 %","11 %","10 %","10 %","10 %","9 %","9 %","9 %","8 %","6 %","5 %","5 %","5 %","5 %"]
[" Medical",null,"4 - 5 %","5 - 6 %","5 - 6 %","3 - 5 %","3 - 5 %","2 - 5 %","2 - 4 %","2 - 4 %","1 - 4 %","1 - 4 %","1 - 4 %","1 - 4 %","1 - 4 %","1 - 4 %","1 - 4 %"]
[" Children",null,"0 %","0 %","0 %","0 %","0 %","0 %","0 %","0 %","0 %","0 %","0 %","0 %","0 %","0 %","0 %"]
[" Clothing",null,"3 - 4 %","3 - 4 %","2 - 3 %","2 - 4 %","1 - 4 %","1 - 3 %","1 - 3 %","1 - 3 %","1 - 3 %","1 - 3 %","1 - 3 %","1 - 3 %","1 - 3 %","1 - 3 %","1 - 3 %"]
["Entertainment",null,"5 - 6 %","5 - 6 %","4 - 5 %","2 - 4 %","2 - 4 %","2 - 4 %","2 - 4 %","2 - 4 %","2 - 4 %","1 - 4 %","1 - 4 %","1 - 4 %","1 - 4 %","1 - 4 %","1 - 4 %"]
[" Misc.",null,"3 %","3 %","3 %","3 %","2 - 3 %","2 - 3 %","2 - 3 %","2 - 3 %","2 - 3 %","1 - 3 %","1 - 3 %","1 - 3 %","1 - 3 %","1 - 3 %","1 - 3 %"]
["TOTAL EXPENSE",null,"70 - 80 %"," 69 -79 %","66 - 76 %","58 - 73 %","54 - 72 %","50 - 70 %","46 - 66 %","41 - 65 %","38 - 63 %","34 - 61 %","29 - 59 %","27 - 57 %","27 - 57 %","27 - 57 %","27 - 57%"]
[]
[]
["Single 2 or Less"]
["Income Level",null,20000,30000,40000,50000,60000,70000,80000,90000,100000,110000,120000,140000,160000,180000,200000]
[]
[" Taxes",null,"15 %","16 %","19 %","22 %","23 %","25 %","29 %","30 %","32 %","34 %","36 %","38 %","38 %","38 %","38 %"]
[" Giving",null,"5 - 10 %","5 - 10 %","5 - 10 %","5 - 15 %","5 - 18 %","5 - 20 %","5 - 22 %","5 - 24 %","5 - 25 %","5 - 27 %","5 - 30 %","5 - 30 %","5 - 30 %","5 - 30 %","5 - 30 %"]
[" Savings",null,"2 - 3 %","3 - 4 %","3 - 4 %","3 - 5 %","3 - 5 %","3 - 5 %","3 - 5 %","3 - 5 %","2 - 5 %","2 - 5 %","1 - 5 %","1 - 5 %","1 - 5 %","1 - 5 %","1 - 5 %"]
[" Debt (non mortgage)",null,"0 - 5 %","0 - 5 %","0 - 5 %","0 - 5 %","0 - 5 %","0 - 5 %","0 - 5 %","0 - 5 %","0 - 5 %","0 - 5 %","0 - 5 %","0 - 5 %","0 - 5 %","0 - 5 %","0 - 5 %"]
[]
[" Housing",null,"20 - 25 %","20 - 25 %","20 - 25 %","18 - 23 %","17 - 23 %","15 - 23 %","15 - 23 %","12 - 23 %","12 - 21 %","12 - 21 %","11 - 21 %","11 - 19 %","11 - 19 %","11 - 19 %","11 - 19 %"]
[" Auto",null,"12 %","10 %","9 %","7 %","6 %","5 %","4 %","4 %","4 %","3 %","3 %","2 %","2 %","2 %","2 %"]
[" Insurance",null,"4 % ","4 % ","4 % ","3 %","3 %","3 %","3 %","3 %","3 %","3 %","3 %","3 %","3 %","3 %","3 %"]
[" Food",null,"12 %","12 %","11 %","10 %","10 %","10 %","9 %","9 %","9 %","8 %","6 %","5 %","5 %","5 %","5 %"]
[" Medical",null,"4 - 5 %","4 - 5 %","4 - 5 %","3 - 5 %","3 - 5 %","2 - 5 %","2 - 4 %","2 - 4 %","1 - 4 %","1 - 4 %","1 - 4 %","1 - 4 %","1 - 4 %","1 - 4 %","1 - 4 %"]
[" Children",null,"7 - 8 %","7 - 8 %","7 - 8 %","7 - 9 %","7 - 9 %","7 - 9 %","5 - 8 %","3 - 7 %","2 - 7 %","2 - 7 %","1 - 7 %","1 - 7 %","1 - 7 %","1 - 7 %","1 - 7 %"]
[" Clothing",null,"3 - 4 %","3 - 4 %","2 - 3 %","2 - 4 %","1 - 4 %","1 - 3 %","1 - 3 %","1 - 3 %","1 - 3 %","1 - 3 %","1 - 3 %","1 - 3 %","1 - 3 %","1 - 3 %","1 - 3 %"]
["Entertainment",null,"3 - 4 %","3 - 4 %","3 - 4 %","2 - 4 %","2 - 4 %","2 - 4 %","2 - 4 %","2 - 4 %","2 - 4 %","1 - 4 %","1 - 4 %","1 - 4 %","1 - 4 %","1 - 4 %","1 - 4 %"]
[" Misc.",null,"3 %","3 %","3 %","3 %","2 - 3 %","2 - 3 %","2 - 3 %","2 - 3 %","2 - 3 %","1 - 3 %","1 - 3 %","1 - 3 %","1 - 3 %","1 - 3 %","1 - 3 %"]
["TOTAL EXPENSE",null,"70 - 80 %"," 69 -79 %","66 - 76 %","58 - 73 %","54 - 72 %","50 - 70 %","46 - 66 %","41 - 65 %","38 - 63 %","34 - 61 %","29 - 59 %","27 - 57 %","27 - 57 %","27 - 57 %","27 - 57 %"]
[]
["Married 2 or Less"]
["Income Level",null,20000,30000,40000,50000,60000,70000,80000,90000,100000,110000,120000,140000,160000,180000,200000]
[]
[" Taxes",null,"15 %","16 %","19 %","22 %","23 %","25 %","29 %","30 %","32 %","34 %","36 %","38 %","38 %","38 %","38 %"]
[" Giving",null,"5 - 10 %","5 - 10 %","5 - 10 %","5 - 15 %","5 - 18 %","5 - 20 %","5 - 22 %","5 - 24 %","5 - 25 %","5 - 27 %","5 - 30 %","5 - 30 %","5 - 30 %","5 - 30 %","5 - 30 %"]
[" Savings",null,"2 - 3 %","3 - 4 %","3 - 4 %","3 - 5 %","3 - 5 %","3 - 5 %","3 - 5 %","3 - 5 %","2 - 5 %","2 - 5 %","1 - 5 %","1 - 5 %","1 - 5 %","1 - 5 %","1 - 5 %"]
[" Debt (non mortgage)",null,"0 - 5 %","0 - 5 %","0 - 5 %","0 - 5 %","0 - 5 %","0 - 5 %","0 - 5 %","0 - 5 %","0 - 5 %","0 - 5 %","0 - 5 %","0 - 5 %","0 - 5 %","0 - 5 %","0 - 5 %"]
[]
[" Housing",null,"20 - 25 %","20 - 25 %","20 - 25 %","18 - 23 %","17 - 23 %","15 - 23 %","15 - 23 %","12 - 23 %","12 - 21 %","12 - 21 %","11 - 21 %","11 - 19 %","11 - 19 %","11 - 19 %","11 - 19 %"]
[" Auto",null,"12 %","10 %","9 %","7 %","6 %","5 %","4 %","4 %","4 %","3 %","3 %","2 %","2 %","2 %","2 %"]
[" Insurance",null,"4 % ","4 % ","4 % ","3 %","3 %","3 %","3 %","3 %","3 %","3 %","3 %","3 %","3 %","3 %","3 %"]
[" Food",null,"12 %","12 %","11 %","10 %","10 %","10 %","9 %","9 %","9 %","8 %","6 %","5 %","5 %","5 %","5 %"]
[" Medical",null,"4 - 5 %","4 - 5 %","4 - 5 %","3 - 5 %","3 - 5 %","2 - 5 %","2 - 4 %","2 - 4 %","1 - 4 %","1 - 4 %","1 - 4 %","1 - 4 %","1 - 4 %","1 - 4 %","1 - 4 %"]
[" Children",null,"7 - 8 %","7 - 8 %","7 - 8 %","7 - 9 %","7 - 9 %","7 - 9 %","5 - 8 %","3 - 7 %","2 - 7 %","2 - 7 %","1 - 7 %","1 - 7 %","1 - 7 %","1 - 7 %","1 - 7 %"]
[" Clothing",null,"3 - 4 %","3 - 4 %","2 - 3 %","2 - 4 %","1 - 4 %","1 - 3 %","1 - 3 %","1 - 3 %","1 - 3 %","1 - 3 %","1 - 3 %","1 - 3 %","1 - 3 %","1 - 3 %","1 - 3 %"]
["Entertainment",null,"3 - 4 %","3 - 4 %","3 - 4 %","2 - 4 %","2 - 4 %","2 - 4 %","2 - 4 %","2 - 4 %","2 - 4 %","1 - 4 %","1 - 4 %","1 - 4 %","1 - 4 %","1 - 4 %","1 - 4 %"]
[" Misc.",null,"3 %","3 %","3 %","3 %","2 - 3 %","2 - 3 %","2 - 3 %","2 - 3 %","2 - 3 %","1 - 3 %","1 - 3 %","1 - 3 %","1 - 3 %","1 - 3 %","1 - 3 %"]
["TOTAL EXPENSE",null,"70 - 80 %"," 69 -79 %","66 - 76 %","58 - 73 %","54 - 72 %","50 - 70 %","46 - 66 %","41 - 65 %","38 - 63 %","34 - 61 %","29 - 59 %","27 - 57 %","27 - 57 %","27 - 57 %","27 - 57 %"]
[]
[]
[]
["Single More than 2"]
["Income Level",null,20000,30000,40000,50000,60000,70000,80000,90000,100000,110000,120000,140000,160000,180000,200000]
[]
[" Taxes",null,"15 %","16 %","19 %","22 %","23 %","25 %","29 %","30 %","32 %","34 %","36 %","38 %","38 %","38 %","38 %"]
[" Giving",null,"5 - 10 %","5 - 10 %","5 - 10 %","5 - 15 %","5 - 18 %","5 - 20 %","5 - 22 %","5 - 24 %","5 - 25 %","5 - 27 %","5 - 30 %","5 - 30 %","5 - 30 %","5 - 30 %","5 - 30 %"]
[" Savings",null,"2 - 3 %","3 - 4 %","3 - 4 %","3 - 5 %","3 - 5 %","3 - 5 %","3 - 5 %","3 - 5 %","2 - 5 %","2 - 5 %","1 - 5 %","1 - 5 %","1 - 5 %","1 - 5 %","1 - 5%"]
[" Debt (non mortgage)",null,"0 - 5 %","0 - 5 %","0 - 5 %","0 - 5 %","0 - 5 %","0 - 5 %","0 - 5 %","0 - 5 %","0 - 5 %","0 - 5 %","0 - 5 %","0 - 5 %","0 - 5 %","0 - 5 %","0 - 5 %"]
[]
[" Housing",null,"20 - 25 %","20 - 25 %","20 - 25 %","18 - 23 %","17 - 23%","15 - 23%","15 - 23%","12 - 23 %","12 - 21 %","12 - 21 %","11 - 21 %","11 - 19 %","11 - 19 %","11 - 19 %","11 - 19%"]
[" Auto",null,"12 %","10 %","9 %","7 %","6 %","5 %","4 %","4 - 6%","4 - 6 %","3 %","3 %","2 %","2 %","2 %","2%"]
[" Insurance",null,"4 % ","4 % ","4 % ","3 - 5 %","3 - 5 %","3 - 5 %","3 - 6 %","3 - 7%","3 - 7 %","3% - 7 %","3% - 7 %","3 - 7 %","3 - 7 %","3 - 7 %","3% - 7%"]
[" Food",null,"12 %","12 %","11 %","10 %","11 %","10 %","9 %","10 %","11 %","8 %","6 %","5 %","5 %","5 %","5%"]
[" Medical",null,"4 - 5 %","4 - 5 %","4 - 5 %","3 - 5 %","3 - 5 %","2 - 5 %","2 - 4 %","2 - 4 %","1 - 4 %","1 - 4 %","1 - 4 %","1 - 4 %","1 - 4 %","1 - 4 %","1 - 4%"]
[" Children",null,"7 - 8 %","7 - 8 %","7 - 8 %","7 - 9 %","7 - 9 %","7 - 9 %","5 - 8 %","3 - 7 %","2 - 7 %","2 - 7 %","1 - 7 %","1 - 7 %","1 - 7 %","1 - 7 %","1 - 7%"]
[" Clothing",null,"3 - 4 %","3 - 4 %","2 - 3 %","2 - 4 %","1 - 4 %","1 - 3 %","1 - 3 %","1 - 3 %","1 - 3 %","1 - 3 %","1 - 3 %","1 - 3 %","1 - 3 %","1 - 3 %","1 - 3%"]
["Entertainment",null,"3 - 4 %","3 - 4 %","3 - 4 %","2 - 4 %","2 - 4 %","2 - 4 %","2 - 4 %","2 - 4 %","2 - 4 %","1 - 4 %","1 - 4 %","1 - 4 %","1 - 4 %","1 - 4 %","1 - 4%"]
[" Misc.",null,"3 %","3 %","3 %","3 %","2 - 3 %","2 - 3 %","2 - 3 %","2 - 3 %","2 - 3 %","1 - 3 %","1 - 3 %","1 - 3 %","1 - 3 %","1 - 3 %","1 - 3%"]
["TOTAL EXPENSE",null,"70 - 80 %"," 69 -79 %","66 - 76 %","58 - 75 %","54 - 74 %","50 - 72 %","46 - 69 %","41 - 69 %","38 - 68 %","34 - 64 %","29 - 62 %","27 - 60 %","27 - 60 %","27 - 60 %","27 - 60%"]
[]
[]
["Married More than 2"]
["Income Level",null,20000,30000,40000,50000,60000,70000,80000,90000,100000,110000,120000,140000,160000,180000,200000]
[]
[" Taxes",null,"15 %","16 %","19 %","22 %","23 %","25 %","29 %","30 %","32 %","34 %","36 %","38 %","38 %","38 %","38 %"]
[" Giving",null,"5 - 10 %","5 - 10 %","5 - 10 %","5 - 15 %","5 - 18 %","5 - 20 %","5 - 22 %","5 - 24 %","5 - 25 %","5 - 27 %","5 - 30 %","5 - 30 %","5 - 30 %","5 - 30 %","5 - 30 %"]
[" Savings",null,"2 - 3 %","3 - 4 %","3 - 4 %","3 - 5 %","3 - 5 %","3 - 5 %","3 - 5 %","3 - 5 %","2 - 5 %","2 - 5 %","1 - 5 %","1 - 5 %","1 - 5 %","1 - 5 %","1 - 5%"]
[" Debt (non mortgage)",null,"0 - 5 %","0 - 5 %","0 - 5 %","0 - 5 %","0 - 5 %","0 - 5 %","0 - 5 %","0 - 5 %","0 - 5 %","0 - 5 %","0 - 5 %","0 - 5 %","0 - 5 %","0 - 5 %","0 - 5 %"]
[]
[" Housing",null,"20 - 25 %","20 - 25 %","20 - 25 %","18 - 23 %","17 - 23%","15 - 23%","15 - 23%","12 - 23 %","12 - 21 %","12 - 21 %","11 - 21 %","11 - 19 %","11 - 19 %","11 - 19 %","11 - 19%"]
[" Auto",null,"12 %","10 %","9 %","7 %","6 %","5 %","4 %","4 - 6%","4 - 6 %","3 %","3 %","2 %","2 %","2 %","2%"]
[" Insurance",null,"4 % ","4 % ","4 % ","3 - 5 %","3 - 5 %","3 - 5 %","3 - 6 %","3 - 7%","3 - 7 %","3% - 7 %","3% - 7 %","3 - 7 %","3 - 7 %","3 - 7 %","3% - 7%"]
[" Food",null,"12 %","12 %","11 %","10 %","11 %","10 %","9 %","10 %","11 %","8 %","6 %","5 %","5 %","5 %","5%"]
[" Medical",null,"4 - 5 %","4 - 5 %","4 - 5 %","3 - 5 %","3 - 5 %","2 - 5 %","2 - 4 %","2 - 4 %","1 - 4 %","1 - 4 %","1 - 4 %","1 - 4 %","1 - 4 %","1 - 4 %","1 - 4%"]
[" Children",null,"7 - 8 %","7 - 8 %","7 - 8 %","7 - 9 %","7 - 9 %","7 - 9 %","5 - 8 %","3 - 7 %","2 - 7 %","2 - 7 %","1 - 7 %","1 - 7 %","1 - 7 %","1 - 7 %","1 - 7%"]
[" Clothing",null,"3 - 4 %","3 - 4 %","2 - 3 %","2 - 4 %","1 - 4 %","1 - 3 %","1 - 3 %","1 - 3 %","1 - 3 %","1 - 3 %","1 - 3 %","1 - 3 %","1 - 3 %","1 - 3 %","1 - 3%"]
["Entertainment",null,"3 - 4 %","3 - 4 %","3 - 4 %","2 - 4 %","2 - 4 %","2 - 4 %","2 - 4 %","2 - 4 %","2 - 4 %","1 - 4 %","1 - 4 %","1 - 4 %","1 - 4 %","1 - 4 %","1 - 4%"]
[" Misc.",null,"3 %","3 %","3 %","3 %","2 - 3 %","2 - 3 %","2 - 3 %","2 - 3 %","2 - 3 %","1 - 3 %","1 - 3 %","1 - 3 %","1 - 3 %","1 - 3 %","1 - 3%"]
["TOTAL EXPENSE",null,"70 - 80 %"," 69 -79 %","66 - 76 %","58 - 75 %","54 - 74 %","50 - 72 %","46 - 69 %","41 - 69 %","38 - 68 %","34 - 64 %","29 - 62 %","27 - 60 %","27 - 60 %","27 - 60 %","27 - 60%"]

{"sheet":"Intake Page","index":35,"n_rows":287,"n_cols":8,"rows_kept":287,"cut":false,"hidden":false,"merged":[[133,2,133,3],[133,6,133,7],[0,1,0,8],[1,1,1,8],[2,1,2,8],[3,1,3,8],[4,1,4,8],[8,1,8,7]]}
[null,"G.I.F.T. Ministry"]
[null,"647 Park Meadow Dr., Suite I"]
[null,"Westerville, OH 43081"]
[null,"614-888-2222"]
[]
[]
[]
[]
[null,"Thank you for your interest in the financial planning services offered by J. H. McKewen III and Associates / GIFT Ministries.  To assist us in evaluating your current and future financial condition you may need to collect some information prior to our meeting.  The more information you provide, the more profitable your meeting will be. The information required may include the following:"]
[]
[null,"-       A complete listing of all assets, including paystubs and account balances"]
[]
[null,"-        A summary of average monthly expenses.  You'll want to use the last 3-6 months of bank statements to help you arrive at an average."]
[]
[null,"-        Any debt information you currently have, including monthly payment, interest rate, and balance."]
[]
[null,"·       Specific ideas concerning your short- and long-term financial goals, as well as any general financial concerns you might have; (form enclosed)"]
[]
[null,"-       Summaries of current employer-provided benefit programs, including life/health/disability insurance programs, and projected retirement benefits."]
[]
[null,"·       Current life/disability insurance policies you have for members of the family (other than those provided by your employer)."]
[]
[null,"·       Summary Information of any investment accounts, including type of account, return on investment, and balance."]
[]
[null,"If you should have any questions regarding any of the above items, please contact us.  Please submit forms to our office and a counselor will be assigned."]
[]
[null,"Sincerely,"]
[]
[null,"J. H. McKewen III, RIA"]
[]
[]
[null,"**Please fill out the areas in blue below"]
[]
[]
["BASIC INFORMATION"]
[null,"How did you find out about our services?"]
[]
[]
[]
[]
[]
[null,"Are you currently involved in a..."]
[null,"Home Church:"]
[null,"Small Group:"]
[null,"Ministry Group:"]
[null,"Fellowship Group:"]
[]
[null,"Name of group:"]
[]
[]
[null,"Would you like assistance with..."]
[null,"Budget:"]
[null,"Debt Reduction:"]
[null,"Savings:"]
[null,"Giving:"]
[null,"Insurance:"]
[null,"Investments:"]
[null,"Retirement Planning:"]
[null,"Education Planning:"]
[null,"Legal:"]
[null,"Wills:"]
[null,"Trusts:"]
[null,"Bankruptcy:"]
[null,"CPA:"]
[null,"Accounting:"]
[null,"Taxes:"]
[null,"Other (please list):"]
[]
[]
[null,"Please briefly explain your goals for meeting with a counselor."]
[]
[]
[]
[]
[]
[null,"What are the best days/times for you to meet with a counselor (including evenings and weekends)?"]
[]
[]
[]
[]
[]
["PERSONAL INFORMATION"]
[]
[null,"Your First Name:",null,null,"     "]
[null,"Your Last Name:"]
[null,"Your Date of Birth:"]
[null,"Address:",null,null,"     "]
[null,"City, State Zip:",null,"     "]
[null,"Your Phone Number:"]
[null,"Your E-mail Address:"]
[null,"Your Employer:",null,"     "]
[null,"Your Business Phone Number:"]
[]
[null,"Spouse's First Name:"]
[null,"Spouse's Last Name:"]
[null,"Spouse's Date of Birth:"]
[null,"Spouse's Cell Phone Number:"]
[null,"Spouse's E-mail Address:"]
[null,"Spouse's Employer:"]
[null,"Spouse's Business Number:"]
[]
[null,"Investment Risk Tolerance: (1-10)"]
[null,"Your risk Tolerance #:"]
[null,"Spouse risk tolerance #:"]
[]
[null,"Children/Grandchildren Information for Education Funds:"]
[null,null,"First name:","DOB:"]
[null,"Child #1:"]
[null,"Child #2:"]
[null,"Child #3:"]
[null,"Child #4:"]
[null,"Child #5:"]
[]
["FINANCIAL INFORMATION - ASSETS"]
[null,"Primary Income"]
[null,null,"Income #1","Income #2"]
[null,"How often are you paid:"]
[null,"Gross Income:"]
[null,"Social Security/PERS:"]
[null,"Medicare:"]
[null,"Federal:"]
[null,"State:"]
[null,"City / Local:"]
[null,"Dues:"]
[null,"401(k)/403(b):"]
[null,"Pre-Tax SAVINGS:"]
[null,"HSA/FSA:"]
[null,"Other (per period):"]
[null,"Other (per period):"]
[null,"Other (per period):"]
[null,"Other (per period):"]
[]
[]
[null,"Other Income","Income 1",null,null,null,"Income 2"]
[null,null,"Amount","# of times per year?",null,null,"Amount","# of times per year?"]
[null,"Bonus:",null,null,null,"Bonus:"]
[null,"Interest Earned:",null,null,null,"Interest Earned:"]
[null,"Rental Income:",null,null,null,"Rental Income:"]
[null,"Other Income:",null,null,null,"Other Income:"]
[null,"Other Income:",null,null,null,"Other Income:"]
[]
[]
[null,"Account Balances","Owner","Interest Rate","Balance"]
[null,"Checking #1:"]
[null,"Checking #2:"]
[null,"Savings #1:"]
[null,"Savings #2:"]
[null,"Other:"]
[]
[]
[null,"Retirement Accounts"]
[null,null,"Owner","Annual Contribution","Balance"]
[null,"401(k) / 403(b) / 457(b):"]
[null,"401(k) / 403(b) / 457(b):"]
[null,"OPERS / STRS / SERS:"]
[null,"OPERS / STRS / SERS:"]
[null,"Other #1:"]
[null,"Other #2"]
[null,null,null,null,null,null,"     "]
[]
[null,"Investment Account Balances"]
[null,null,"Owner","Annual Contribution","Balance"]
[null,"Joint/Individual Acct:"]
[null,"Joint/Individual Acct:"]
[null,"IRAs:"]
[null,"IRAs:"]
[null,"Roth IRAs:"]
[null,"Roth IRAs:"]
[null,"Other:"]
[null,"Other:"]
[]
[]
[null,"SS/Pension"]
[null,null,"Owner","Payout at 62","Payout at 67","Payout at 70"]
[null,"Social Security:"]
[null,"Social Security:"]
[null,"Pension:"]
[null,"Pension:"]
[]
[]
[null,"Life Insurance (not from paycheck)"]
[null,"Insurer","Insured","Type of Policy","Death Benefit","Cash Value","Year Issued","Annual Premium"]
[]
[]
[]
[]
[]
[]
[]
[null,"Disability Insurance"]
[null,"Do you have Disability Insurance?:"]
[null,"Is it part of a company benefit?:"]
[]
[]
[null,"Other Insurance (not from paycheck)"]
[null,"Insurer","Insured","Type of Policy","Benefit Amount","Annual Premium"]
[]
[]
[]
[]
["FINANCIAL INFORMATION - LIABILITIES"]
["Current Spending"]
[]
[null,"Giving","Monthly Amount"]
[null,"Giving Pledge:"]
[null,"Charities:"]
[null,"Missionaries:"]
[null,"Christmas/Birthdays:"]
[null,"Other:"]
[]
[]
[null,"Saving"]
[null,"General:"]
[null,"Education:"]
[null,"Retirement:"]
[null,"Other:"]
[]
[]
[null,"Consumer Debt Payments (Credit Cards, Student Loans, Healthcare)"]
[null,"Debt Name","Debt Type","Balance","Interest Rate","Minimum Payment","Current Payment"]
[]
[]
[]
[]
[]
[]
[]
[]
[]
[]
[]
[]
[]
[]
[null,"Mortgage Debts","Balance","Interest Rate","Minimum Payment","Current Payment"]
[null,"Primary Mortgage:"]
[null,"Secondary Mortgage:"]
[null,"HELOC:"]
[null,"Home Equity Loan:"]
[]
[]
[]
[null,null,"Monthly Amount",null,null,"Monthly Amount"]
[null,"Housing",null,null,"Insurance"]
[null,"Mortgage/Rent:",null,null,"Life:"]
[null,"Property Taxes:",null,null,"Disability:"]
[null,"Electricity:",null,null,"Health Premium:"]
[null,"Natural Gas:",null,null,"Automobile:"]
[null,"Water:",null,null,"Household:"]
[null,"Condo Fee/Hoa:",null,null,"Excess Liability:"]
[null,"Cellphones:",null,null,"Other:"]
[null,"Internet/Cable:",null,null,"Other:"]
[null,"Cleaning Services:"]
[null,"Sewer/Trash:",null,null,"Children's Expenses"]
[null,"Repairs/Improvement:",null,null,"Tuition:"]
[null,"Furnishings:",null,null,"School Lunches:"]
[null,"Other:",null,null,"Day Care:"]
[null,"Other:",null,null,"Allowances:"]
[null,null,null,null,"Lessons:"]
[null,"Auto",null,null,"Other:"]
[null,"Gasoline:",null,null,"Other:"]
[null,"Maintenance & Repairs:"]
[null,"Parking/Public Transportation:",null,null,"Clothing"]
[null,"Registration/Taxes:",null,null,"Clothing Other:"]
[null,"Other:",null,null,"Clothing Other:"]
[]
[null,"Food",null,null,"Entertainment"]
[null,"Groceries:",null,null,"Evenings Out:"]
[null,"Restaurants:",null,null,"Baby Sitters:"]
[null,"Bars/Alcohol:",null,null,"Media Subscriptions:"]
[null,"Coffee Shops:",null,null,"Paper Subscriptions:"]
[null,"Other:",null,null,"Dues/Clubs/Activities:"]
[null,null,null,null,"Vacations:"]
[null,"Medical Expenses",null,null,"Other:"]
[null,"Physicians:",null,null,"Other:"]
[null,"Dentists:"]
[null,"Pharmaceuticals:",null,null,"Miscellaneous"]
[null,"Vision:",null,null,"Toiletries:"]
[null,"Other:",null,null,"Dry Cleaning:"]
[null,"Other:",null,null,"Professional Fees:"]
[null,null,null,null,"Animals:"]
[null,null,null,null,"Beauty & Barber:"]
[null,null,null,null,"Cash Allowances:"]
[null,null,null,null,"Other Services:"]
[null,null,null,null,"Other Purchases:"]
[null,null,null,null,"Other:"]
[null,null,null,null,"Other:"]